{"text_format":"1","workbook":"xlsx","n_sheets":4,"sheets":["STP-SO Schule","STP1","STP2","STP3"],"not_rendered":{"charts":0,"images":0,"macros":1,"external_links":3,"defined_names":1,"comments":1,"pivot_tables":0},"unopened":[],"bounds":{"document_bytes":16777216,"sheet_cells":100000,"rows_first":2000,"rows_last":500,"rows_between":2000,"halvings":0,"cell_chars":16384,"cell_head_chars":4096},"cells_cut":0,"cells_raw":0,"read":"whole","date_system":"1900"}

{"sheet":"STP-SO Schule","index":0,"n_rows":103,"n_cols":89,"rows_kept":103,"cut":false,"hidden":false,"merged":[[84,97,85,99],[68,8,68,9],[83,0,83,2],[84,14,85,14],[84,15,85,17],[84,96,85,96],[0,0,0,7],[0,8,0,17],[1,8,1,17],[1,0,1,7],[2,18,2,88],[0,18,0,88],[1,18,1,88],[4,86,4,87],[5,86,5,87],[6,64,6,73],[2,0,2,7],[6,20,6,29],[2,8,2,17],[4,4,4,9],[5,11,5,15],[4,11,4,15],[5,4,5,9],[30,0,30,2],[6,53,6,62],[6,31,6,40],[6,42,6,51],[37,18,37,88],[6,75,6,84],[37,8,37,17],[35,5,35,18],[47,17,47,18],[35,0,35,1],[48,7,48,9],[47,7,47,9],[38,0,38,7],[48,14,48,15],[44,14,44,15],[38,8,38,17],[48,17,48,18],[39,8,39,17],[46,17,46,18],[38,18,38,88],[37,0,37,7],[47,10,47,11],[46,12,46,13],[47,12,47,13],[48,12,48,13],[46,14,46,15],[48,10,48,11],[49,7,49,9],[51,11,51,13],[49,10,49,11],[49,12,49,13],[90,6,90,7],[68,6,68,7],[69,6,69,7],[70,6,70,7],[54,0,54,9],[102,19,102,87],[102,0,102,18],[96,0,96,5],[96,17,96,19],[96,14,96,15],[98,17,98,18],[100,17,100,19],[100,14,100,15],[100,0,100,9],[100,10,100,13],[98,12,98,13],[98,0,98,5],[96,10,96,13],[98,14,98,15],[39,18,39,88],[46,10,46,11],[47,14,47,15],[94,0,94,6],[54,10,54,13],[54,17,54,19],[51,17,51,19],[52,17,52,19],[51,14,51,15],[54,14,54,15],[52,4,52,13],[74,6,74,7],[51,0,51,8],[52,14,52,15],[49,14,49,15],[39,0,39,7]]}
["Status / Schuljahr",null,null,null,null,null,null,null,"STELLENPLAN",null,null,null,null,null,null,null,null,null,{"$f":"'STP1'!E2 & \" - \" & 'STP1'!D2","v":"SO Salzburg - 501013"}]
[{"$f":"IF('STP1'!F2=0,\"Planung\",IF('STP1'!F2=1,\"Vorl. Stellenplan\",IF('STP1'!F2=2,\"Endg. Stellenplan\",IF('STP1'!F2=3,\"Tagesaktueller Stellenplan\",\"\")))) & \" \" & 'STP1'!A2","v":"Endg. Stellenplan 2021/22"},null,null,null,null,null,null,null,"Land Salzburg",null,null,null,null,null,null,null,null,null,{"$f":"CHOOSE('STP1'!B2,\"Salzburg-Stadt\",\"Hallein\",\"Salzburg-Umgebung\",\"St. Johann\",\"Tamsweg\",\"Zell am See\")","v":"Salzburg-Stadt"}]
[{"$f":"\"Genehmigungsstatus: \" & 'STP1'!EL2","v":"Genehmigungsstatus: genehmigt"},null,null,null,null,null,null,null,"Version 9.1",null,null,null,null,null,null,null,null,null,{"$f":"\"Stichtag: \" & TEXT('STP1'!G2,\"TT.MM.JJJJ\")","v":"Stichtag: 01.10.2021"}]
[]
["Schul-","Klassen-","Schul-",null,null,null,null,null,null,null,"davon",null,null,null,null,null,"davon","Anz.","davon","Gesamt-",null,null,null,null,null,null,null,null,null,null,null,null,null,null,null,null,null,null,null,null,null,null,null,null,null,null,null,null,null,null,null,null,null,null,null,null,null,null,null,null,null,null,null,null,null,null,null,null,null,null,null,null,null,null,null,null,null,null,null,null,null,null,null,null,null,null,"davon SchülerInnen"]
["stufe","name","stufen",null,"Anzahl SchülerInnen",null,null,null,null,null,"ohne","Anzahl SchülerInnen",null,null,null,null,"ohne","Schü.:","ohne","schüler-",null,null,null,null,null,null,null,null,null,null,null,null,null,null,null,null,null,null,null,null,null,null,null,null,null,null,null,null,null,null,null,null,null,null,null,null,null,null,null,null,null,null,null,null,null,null,null,null,null,null,null,null,null,null,null,null,null,null,null,null,null,null,null,null,null,null,"nichtdt. Erstsprache",null,"sprengel-"]
["der","laut","in der","Klassen","Stufe","Stufe","Stufe","Stufe","Stufe","Stufe","SPF","Stufe","Stufe","Stufe","Stufe","Stufe","SPF","Stufe","SPF","zahl","allgemeine Sonderschüler",null,null,null,null,null,null,null,null,null,"Summe","Sondererziehungs-Schüler",null,null,null,null,null,null,null,null,null,"Summe","schwerstbehind. Schüler",null,null,null,null,null,null,null,null,null,"Summe","körperbehinderte Schüler",null,null,null,null,null,null,null,null,null,"Summe","mehrfachbehinderte Schüler",null,null,null,null,null,null,null,null,null,"Summe","sinnesbehinderte Schüler",null,null,null,null,null,null,null,null,null,"Summe",null,"davon","fremde"]
["Klasse","BiDok","Klasse","art",0,1,2,3,4,"0-4","0-4",5,6,7,8,"5-8","5-8",9,9,null,0,1,2,3,4,5,6,7,8,9,"ASO",0,1,2,3,4,5,6,7,8,9,"SE",0,1,2,3,4,5,6,7,8,9,"SB",0,1,2,3,4,5,6,7,8,9,"KB",0,1,2,3,4,5,6,7,8,9,"MB",0,1,2,3,4,5,6,7,8,9,"SI","Gesamt","AO","Kinder"]
[{"$f":"IF('STP2'!I2=\"99\",\"\",'STP2'!I2)","v":"03"},{"$f":"IF(A9=\"\",\"\",'STP2'!J2)","v":"1GUS"},{"$f":"IF(A9=\"\",\"\",COUNTIF(E9:I9,\">0\")+COUNTIF(L9:O9,\">0\")+COUNTIF(R9,\">0\"))","v":4},{"$f":"IF(A9=\"\",\"\",IF('STP2'!K2,\"ASO\",IF('STP2'!L2,\"SE\",IF('STP2'!M2,\"KB\",IF('STP2'!N2,\"SB\",IF('STP2'!O2,\"SI\",IF('STP2'!P2,\"MB\",\"S\")))))))","v":"SB"},{"$f":"IF(A9=\"\",\"\",'STP2'!S2)","v":0},{"$f":"IF(A9=\"\",\"\",'STP2'!V2)","v":1},{"$f":"IF(A9=\"\",\"\",'STP2'!Y2)","v":1},{"$f":"IF(A9=\"\",\"\",'STP2'!AB2)","v":4},{"$f":"IF(A9=\"\",\"\",'STP2'!AE2)","v":1},{"$f":"IF(A9=\"\",\"\",SUM(E9:I9))","v":7},{"$f":"IF(A9=\"\",\"\", J9-'STP2'!T2-'STP2'!W2-'STP2'!Z2-'STP2'!AC2-'STP2'!AF2)","v":0},{"$f":"IF(A9=\"\",\"\",'STP2'!AH2)","v":0},{"$f":"IF(A9=\"\",\"\",'STP2'!AK2)","v":0},{"$f":"IF(A9=\"\",\"\",'STP2'!AN2)","v":0},{"$f":"IF(A9=\"\",\"\",'STP2'!AQ2)","v":0},{"$f":"IF(A9=\"\",\"\",SUM(L9:O9))","v":0},{"$f":"IF(A9=\"\",\"\",P9-'STP2'!AI2-'STP2'!AL2-'STP2'!AO2-'STP2'!AR2)","v":0},{"$f":"IF(A9=\"\",\"\",'STP2'!AT2)","v":0},{"$f":"IF(A9=\"\",\"\",R9-'STP2'!AU2)","v":0},{"$f":"IF(A9=\"\",\"\",SUM(J9,P9,R9))","v":7},{"$f":"IF(A9=\"\",\"\",'STP2'!CD2)","v":0},{"$f":"IF(A9=\"\",\"\",'STP2'!CE2)","v":0},{"$f":"IF(A9=\"\",\"\",'STP2'!CF2)","v":0},{"$f":"IF(A9=\"\",\"\",'STP2'!CG2)","v":0},{"$f":"IF(A9=\"\",\"\",'STP2'!CH2)","v":1},{"$f":"IF(A9=\"\",\"\",'STP2'!CI2)","v":0},{"$f":"IF(A9=\"\",\"\",'STP2'!CJ2)","v":0},{"$f":"IF(A9=\"\",\"\",'STP2'!CK2)","v":0},{"$f":"IF(A9=\"\",\"\",'STP2'!CL2)","v":0},{"$f":"IF(A9=\"\",\"\",'STP2'!CM2)","v":0},{"$f":"IF(A9=\"\",\"\",SUM(U9:AD9))","v":1},{"$f":"IF(A9=\"\",\"\",'STP2'!CN2)","v":0},{"$f":"IF(A9=\"\",\"\",'STP2'!CO2)","v":0},{"$f":"IF(A9=\"\",\"\",'STP2'!CP2)","v":0},{"$f":"IF(A9=\"\",\"\",'STP2'!CQ2)","v":1},{"$f":"IF(A9=\"\",\"\",'STP2'!CR2)","v":0},{"$f":"IF(A9=\"\",\"\",'STP2'!CS2)","v":0},{"$f":"IF(A9=\"\",\"\",'STP2'!CT2)","v":0},{"$f":"IF(A9=\"\",\"\",'STP2'!CU2)","v":0},{"$f":"IF(A9=\"\",\"\",'STP2'!CV2)","v":0},{"$f":"IF(A9=\"\",\"\",'STP2'!CW2)","v":0},{"$f":"IF(A9=\"\",\"\",SUM(AF9:AO9))","v":1},{"$f":"IF(A9=\"\",\"\",'STP2'!CX2)","v":0},{"$f":"IF(A9=\"\",\"\",'STP2'!CY2)","v":0},{"$f":"IF(A9=\"\",\"\",'STP2'!CZ2)","v":1},{"$f":"IF(A9=\"\",\"\",'STP2'!DA2)","v":3},{"$f":"IF(A9=\"\",\"\",'STP2'!DB2)","v":0},{"$f":"IF(A9=\"\",\"\",'STP2'!DC2)","v":0},{"$f":"IF(A9=\"\",\"\",'STP2'!DD2)","v":0},{"$f":"IF(A9=\"\",\"\",'STP2'!DE2)","v":0},{"$f":"IF(A9=\"\",\"\",'STP2'!DF2)","v":0},{"$f":"IF(A9=\"\",\"\",'STP2'!DG2)","v":0},{"$f":"IF(A9=\"\",\"\",SUM(AQ9:AZ9))","v":4},{"$f":"IF(A9=\"\",\"\",'STP2'!DH2)","v":0},{"$f":"IF(A9=\"\",\"\",'STP2'!DI2)","v":0},{"$f":"IF(A9=\"\",\"\",'STP2'!DJ2)","v":0},{"$f":"IF(A9=\"\",\"\",'STP2'!DK2)","v":0},{"$f":"IF(A9=\"\",\"\",'STP2'!DL2)","v":0},{"$f":"IF(A9=\"\",\"\",'STP2'!DM2)","v":0},{"$f":"IF(A9=\"\",\"\",'STP2'!DN2)","v":0},{"$f":"IF(A9=\"\",\"\",'STP2'!DO2)","v":0},{"$f":"IF(A9=\"\",\"\",'STP2'!DP2)","v":0},{"$f":"IF(A9=\"\",\"\",'STP2'!DQ2)","v":0},{"$f":"IF(A9=\"\",\"\",SUM(BB9:BK9))","v":0},{"$f":"IF(A9=\"\",\"\",'STP2'!DR2)","v":0},{"$f":"IF(A9=\"\",\"\",'STP2'!DS2)","v":0},{"$f":"IF(A9=\"\",\"\",'STP2'!DT2)","v":0},{"$f":"IF(A9=\"\",\"\",'STP2'!DU2)","v":0},{"$f":"IF(A9=\"\",\"\",'STP2'!DV2)","v":0},{"$f":"IF(A9=\"\",\"\",'STP2'!DW2)","v":0},{"$f":"IF(A9=\"\",\"\",'STP2'!DX2)","v":0},{"$f":"IF(A9=\"\",\"\",'STP2'!DY2)","v":0},{"$f":"IF(A9=\"\",\"\",'STP2'!DZ2)","v":0},{"$f":"IF(A9=\"\",\"\",'STP2'!EA2)","v":0},{"$f":"IF(A9=\"\",\"\",SUM(BM9:BV9))","v":0},{"$f":"IF(A9=\"\",\"\",'STP2'!EB2)","v":0},{"$f":"IF(A9=\"\",\"\",'STP2'!EC2)","v":1},{"$f":"IF(A9=\"\",\"\",'STP2'!ED2)","v":0},{"$f":"IF(A9=\"\",\"\",'STP2'!EE2)","v":0},{"$f":"IF(A9=\"\",\"\",'STP2'!EF2)","v":0},{"$f":"IF(A9=\"\",\"\",'STP2'!EG2)","v":0},{"$f":"IF(A9=\"\",\"\",'STP2'!EH2)","v":0},{"$f":"IF(A9=\"\",\"\",'STP2'!EI2)","v":0},{"$f":"IF(A9=\"\",\"\",'STP2'!EJ2)","v":0},{"$f":"IF(A9=\"\",\"\",'STP2'!EK2)","v":0},{"$f":"IF(A9=\"\",\"\",SUM(BX9:CG9))","v":1},{"$f":"IF(A9=\"\",\"\",'STP2'!AV2)","v":5},{"$f":"IF(A9=\"\",\"\",'STP2'!AW2)","v":0},{"$f":"IF(A9=\"\",\"\",'STP2'!AX2)","v":0}]
[{"$f":"IF('STP2'!I3=\"99\",\"\",'STP2'!I3)","v":"05"},{"$f":"IF(A10=\"\",\"\",'STP2'!J3)","v":"1aFö"},{"$f":"IF(A10=\"\",\"\",COUNTIF(E10:I10,\">0\")+COUNTIF(L10:O10,\">0\")+COUNTIF(R10,\">0\"))","v":1},{"$f":"IF(A10=\"\",\"\",IF('STP2'!K3,\"ASO\",IF('STP2'!L3,\"SE\",IF('STP2'!M3,\"KB\",IF('STP2'!N3,\"SB\",IF('STP2'!O3,\"SI\",IF('STP2'!P3,\"MB\",\"S\")))))))","v":"ASO"},{"$f":"IF(A10=\"\",\"\",'STP2'!S3)","v":0},{"$f":"IF(A10=\"\",\"\",'STP2'!V3)","v":0},{"$f":"IF(A10=\"\",\"\",'STP2'!Y3)","v":0},{"$f":"IF(A10=\"\",\"\",'STP2'!AB3)","v":0},{"$f":"IF(A10=\"\",\"\",'STP2'!AE3)","v":0},{"$f":"IF(A10=\"\",\"\",SUM(E10:I10))","v":0},{"$f":"IF(A10=\"\",\"\", J10-'STP2'!T3-'STP2'!W3-'STP2'!Z3-'STP2'!AC3-'STP2'!AF3)","v":0},{"$f":"IF(A10=\"\",\"\",'STP2'!AH3)","v":9},{"$f":"IF(A10=\"\",\"\",'STP2'!AK3)","v":0},{"$f":"IF(A10=\"\",\"\",'STP2'!AN3)","v":0},{"$f":"IF(A10=\"\",\"\",'STP2'!AQ3)","v":0},{"$f":"IF(A10=\"\",\"\",SUM(L10:O10))","v":9},{"$f":"IF(A10=\"\",\"\",P10-'STP2'!AI3-'STP2'!AL3-'STP2'!AO3-'STP2'!AR3)","v":0},{"$f":"IF(A10=\"\",\"\",'STP2'!AT3)","v":0},{"$f":"IF(A10=\"\",\"\",R10-'STP2'!AU3)","v":0},{"$f":"IF(A10=\"\",\"\",SUM(J10,P10,R10))","v":9},{"$f":"IF(A10=\"\",\"\",'STP2'!CD3)","v":0},{"$f":"IF(A10=\"\",\"\",'STP2'!CE3)","v":0},{"$f":"IF(A10=\"\",\"\",'STP2'!CF3)","v":0},{"$f":"IF(A10=\"\",\"\",'STP2'!CG3)","v":0},{"$f":"IF(A10=\"\",\"\",'STP2'!CH3)","v":0},{"$f":"IF(A10=\"\",\"\",'STP2'!CI3)","v":5},{"$f":"IF(A10=\"\",\"\",'STP2'!CJ3)","v":0},{"$f":"IF(A10=\"\",\"\",'STP2'!CK3)","v":0},{"$f":"IF(A10=\"\",\"\",'STP2'!CL3)","v":0},{"$f":"IF(A10=\"\",\"\",'STP2'!CM3)","v":0},5,{"$f":"IF(A10=\"\",\"\",'STP2'!CN3)","v":0},{"$f":"IF(A10=\"\",\"\",'STP2'!CO3)","v":0},{"$f":"IF(A10=\"\",\"\",'STP2'!CP3)","v":0},{"$f":"IF(A10=\"\",\"\",'STP2'!CQ3)","v":0},{"$f":"IF(A10=\"\",\"\",'STP2'!CR3)","v":0},{"$f":"IF(A10=\"\",\"\",'STP2'!CS3)","v":1},{"$f":"IF(A10=\"\",\"\",'STP2'!CT3)","v":0},{"$f":"IF(A10=\"\",\"\",'STP2'!CU3)","v":0},{"$f":"IF(A10=\"\",\"\",'STP2'!CV3)","v":0},{"$f":"IF(A10=\"\",\"\",'STP2'!CW3)","v":0},1,{"$f":"IF(A10=\"\",\"\",'STP2'!CX3)","v":0},{"$f":"IF(A10=\"\",\"\",'STP2'!CY3)","v":0},{"$f":"IF(A10=\"\",\"\",'STP2'!CZ3)","v":0},{"$f":"IF(A10=\"\",\"\",'STP2'!DA3)","v":0},{"$f":"IF(A10=\"\",\"\",'STP2'!DB3)","v":0},{"$f":"IF(A10=\"\",\"\",'STP2'!DC3)","v":2},{"$f":"IF(A10=\"\",\"\",'STP2'!DD3)","v":0},{"$f":"IF(A10=\"\",\"\",'STP2'!DE3)","v":0},{"$f":"IF(A10=\"\",\"\",'STP2'!DF3)","v":0},{"$f":"IF(A10=\"\",\"\",'STP2'!DG3)","v":0},2,{"$f":"IF(A10=\"\",\"\",'STP2'!DH3)","v":0},{"$f":"IF(A10=\"\",\"\",'STP2'!DI3)","v":0},{"$f":"IF(A10=\"\",\"\",'STP2'!DJ3)","v":0},{"$f":"IF(A10=\"\",\"\",'STP2'!DK3)","v":0},{"$f":"IF(A10=\"\",\"\",'STP2'!DL3)","v":0},{"$f":"IF(A10=\"\",\"\",'STP2'!DM3)","v":0},{"$f":"IF(A10=\"\",\"\",'STP2'!DN3)","v":0},{"$f":"IF(A10=\"\",\"\",'STP2'!DO3)","v":0},{"$f":"IF(A10=\"\",\"\",'STP2'!DP3)","v":0},{"$f":"IF(A10=\"\",\"\",'STP2'!DQ3)","v":0},0,{"$f":"IF(A10=\"\",\"\",'STP2'!DR3)","v":0},{"$f":"IF(A10=\"\",\"\",'STP2'!DS3)","v":0},{"$f":"IF(A10=\"\",\"\",'STP2'!DT3)","v":0},{"$f":"IF(A10=\"\",\"\",'STP2'!DU3)","v":0},{"$f":"IF(A10=\"\",\"\",'STP2'!DV3)","v":0},{"$f":"IF(A10=\"\",\"\",'STP2'!DW3)","v":0},{"$f":"IF(A10=\"\",\"\",'STP2'!DX3)","v":0},{"$f":"IF(A10=\"\",\"\",'STP2'!DY3)","v":0},{"$f":"IF(A10=\"\",\"\",'STP2'!DZ3)","v":0},{"$f":"IF(A10=\"\",\"\",'STP2'!EA3)","v":0},0,{"$f":"IF(A10=\"\",\"\",'STP2'!EB3)","v":0},{"$f":"IF(A10=\"\",\"\",'STP2'!EC3)","v":0},{"$f":"IF(A10=\"\",\"\",'STP2'!ED3)","v":0},{"$f":"IF(A10=\"\",\"\",'STP2'!EE3)","v":0},{"$f":"IF(A10=\"\",\"\",'STP2'!EF3)","v":0},{"$f":"IF(A10=\"\",\"\",'STP2'!EG3)","v":0},{"$f":"IF(A10=\"\",\"\",'STP2'!EH3)","v":0},{"$f":"IF(A10=\"\",\"\",'STP2'!EI3)","v":0},{"$f":"IF(A10=\"\",\"\",'STP2'!EJ3)","v":0},{"$f":"IF(A10=\"\",\"\",'STP2'!EK3)","v":0},0,{"$f":"IF('STP2'!$I3<>99,'STP2'!AV3,\"\")","v":5},{"$f":"IF('STP2'!$I3<>99,'STP2'!AW3,\"\")","v":0},{"$f":"IF('STP2'!$I3<>99,'STP2'!AX3,\"\")","v":0}]
[{"$f":"IF('STP2'!I4=\"99\",\"\",'STP2'!I4)","v":"06"},{"$f":"IF(A11=\"\",\"\",'STP2'!J4)","v":"2aFö"},1,{"$f":"IF(A11=\"\",\"\",IF('STP2'!K4,\"ASO\",IF('STP2'!L4,\"SE\",IF('STP2'!M4,\"KB\",IF('STP2'!N4,\"SB\",IF('STP2'!O4,\"SI\",IF('STP2'!P4,\"MB\",\"S\")))))))","v":"ASO"},{"$f":"IF(A11=\"\",\"\",'STP2'!S4)","v":0},{"$f":"IF(A11=\"\",\"\",'STP2'!V4)","v":0},{"$f":"IF(A11=\"\",\"\",'STP2'!Y4)","v":0},{"$f":"IF(A11=\"\",\"\",'STP2'!AB4)","v":0},{"$f":"IF(A11=\"\",\"\",'STP2'!AE4)","v":0},0,{"$f":"IF(A11=\"\",\"\", J11-'STP2'!T4-'STP2'!W4-'STP2'!Z4-'STP2'!AC4-'STP2'!AF4)","v":0},{"$f":"IF(A11=\"\",\"\",'STP2'!AH4)","v":0},{"$f":"IF(A11=\"\",\"\",'STP2'!AK4)","v":9},{"$f":"IF(A11=\"\",\"\",'STP2'!AN4)","v":0},{"$f":"IF(A11=\"\",\"\",'STP2'!AQ4)","v":0},9,{"$f":"IF(A11=\"\",\"\",P11-'STP2'!AI4-'STP2'!AL4-'STP2'!AO4-'STP2'!AR4)","v":2},{"$f":"IF(A11=\"\",\"\",'STP2'!AT4)","v":0},{"$f":"IF(A11=\"\",\"\",R11-'STP2'!AU4)","v":0},9,{"$f":"IF(A11=\"\",\"\",'STP2'!CD4)","v":0},{"$f":"IF(A11=\"\",\"\",'STP2'!CE4)","v":0},{"$f":"IF(A11=\"\",\"\",'STP2'!CF4)","v":0},{"$f":"IF(A11=\"\",\"\",'STP2'!CG4)","v":0},{"$f":"IF(A11=\"\",\"\",'STP2'!CH4)","v":0},{"$f":"IF(A11=\"\",\"\",'STP2'!CI4)","v":0},{"$f":"IF(A11=\"\",\"\",'STP2'!CJ4)","v":8},{"$f":"IF(A11=\"\",\"\",'STP2'!CK4)","v":0},{"$f":"IF(A11=\"\",\"\",'STP2'!CL4)","v":0},{"$f":"IF(A11=\"\",\"\",'STP2'!CM4)","v":0},8,{"$f":"IF(A11=\"\",\"\",'STP2'!CN4)","v":0},{"$f":"IF(A11=\"\",\"\",'STP2'!CO4)","v":0},{"$f":"IF(A11=\"\",\"\",'STP2'!CP4)","v":0},{"$f":"IF(A11=\"\",\"\",'STP2'!CQ4)","v":0},{"$f":"IF(A11=\"\",\"\",'STP2'!CR4)","v":0},{"$f":"IF(A11=\"\",\"\",'STP2'!CS4)","v":0},{"$f":"IF(A11=\"\",\"\",'STP2'!CT4)","v":1},{"$f":"IF(A11=\"\",\"\",'STP2'!CU4)","v":0},{"$f":"IF(A11=\"\",\"\",'STP2'!CV4)","v":0},{"$f":"IF(A11=\"\",\"\",'STP2'!CW4)","v":0},1,{"$f":"IF(A11=\"\",\"\",'STP2'!CX4)","v":0},{"$f":"IF(A11=\"\",\"\",'STP2'!CY4)","v":0},{"$f":"IF(A11=\"\",\"\",'STP2'!CZ4)","v":0},{"$f":"IF(A11=\"\",\"\",'STP2'!DA4)","v":0},{"$f":"IF(A11=\"\",\"\",'STP2'!DB4)","v":0},{"$f":"IF(A11=\"\",\"\",'STP2'!DC4)","v":0},{"$f":"IF(A11=\"\",\"\",'STP2'!DD4)","v":0},{"$f":"IF(A11=\"\",\"\",'STP2'!DE4)","v":0},{"$f":"IF(A11=\"\",\"\",'STP2'!DF4)","v":0},{"$f":"IF(A11=\"\",\"\",'STP2'!DG4)","v":0},0,{"$f":"IF(A11=\"\",\"\",'STP2'!DH4)","v":0},{"$f":"IF(A11=\"\",\"\",'STP2'!DI4)","v":0},{"$f":"IF(A11=\"\",\"\",'STP2'!DJ4)","v":0},{"$f":"IF(A11=\"\",\"\",'STP2'!DK4)","v":0},{"$f":"IF(A11=\"\",\"\",'STP2'!DL4)","v":0},{"$f":"IF(A11=\"\",\"\",'STP2'!DM4)","v":0},{"$f":"IF(A11=\"\",\"\",'STP2'!DN4)","v":0},{"$f":"IF(A11=\"\",\"\",'STP2'!DO4)","v":0},{"$f":"IF(A11=\"\",\"\",'STP2'!DP4)","v":0},{"$f":"IF(A11=\"\",\"\",'STP2'!DQ4)","v":0},0,{"$f":"IF(A11=\"\",\"\",'STP2'!DR4)","v":0},{"$f":"IF(A11=\"\",\"\",'STP2'!DS4)","v":0},{"$f":"IF(A11=\"\",\"\",'STP2'!DT4)","v":0},{"$f":"IF(A11=\"\",\"\",'STP2'!DU4)","v":0},{"$f":"IF(A11=\"\",\"\",'STP2'!DV4)","v":0},{"$f":"IF(A11=\"\",\"\",'STP2'!DW4)","v":0},{"$f":"IF(A11=\"\",\"\",'STP2'!DX4)","v":0},{"$f":"IF(A11=\"\",\"\",'STP2'!DY4)","v":0},{"$f":"IF(A11=\"\",\"\",'STP2'!DZ4)","v":0},{"$f":"IF(A11=\"\",\"\",'STP2'!EA4)","v":0},0,{"$f":"IF(A11=\"\",\"\",'STP2'!EB4)","v":0},{"$f":"IF(A11=\"\",\"\",'STP2'!EC4)","v":0},{"$f":"IF(A11=\"\",\"\",'STP2'!ED4)","v":0},{"$f":"IF(A11=\"\",\"\",'STP2'!EE4)","v":0},{"$f":"IF(A11=\"\",\"\",'STP2'!EF4)","v":0},{"$f":"IF(A11=\"\",\"\",'STP2'!EG4)","v":0},{"$f":"IF(A11=\"\",\"\",'STP2'!EH4)","v":0},{"$f":"IF(A11=\"\",\"\",'STP2'!EI4)","v":0},{"$f":"IF(A11=\"\",\"\",'STP2'!EJ4)","v":0},{"$f":"IF(A11=\"\",\"\",'STP2'!EK4)","v":0},0,{"$f":"IF('STP2'!$I4<>99,'STP2'!AV4,\"\")","v":3},{"$f":"IF('STP2'!$I4<>99,'STP2'!AW4,\"\")","v":0},{"$f":"IF('STP2'!$I4<>99,'STP2'!AX4,\"\")","v":0}]
[{"$f":"IF('STP2'!I5=\"99\",\"\",'STP2'!I5)","v":"07"},{"$f":"IF(A12=\"\",\"\",'STP2'!J5)","v":"2agk1"},4,{"$f":"IF(A12=\"\",\"\",IF('STP2'!K5,\"ASO\",IF('STP2'!L5,\"SE\",IF('STP2'!M5,\"KB\",IF('STP2'!N5,\"SB\",IF('STP2'!O5,\"SI\",IF('STP2'!P5,\"MB\",\"S\")))))))","v":"ASO"},{"$f":"IF(A12=\"\",\"\",'STP2'!S5)","v":0},{"$f":"IF(A12=\"\",\"\",'STP2'!V5)","v":0},{"$f":"IF(A12=\"\",\"\",'STP2'!Y5)","v":0},{"$f":"IF(A12=\"\",\"\",'STP2'!AB5)","v":1},{"$f":"IF(A12=\"\",\"\",'STP2'!AE5)","v":0},1,{"$f":"IF(A12=\"\",\"\", J12-'STP2'!T5-'STP2'!W5-'STP2'!Z5-'STP2'!AC5-'STP2'!AF5)","v":0},{"$f":"IF(A12=\"\",\"\",'STP2'!AH5)","v":0},{"$f":"IF(A12=\"\",\"\",'STP2'!AK5)","v":3},{"$f":"IF(A12=\"\",\"\",'STP2'!AN5)","v":4},{"$f":"IF(A12=\"\",\"\",'STP2'!AQ5)","v":1},8,{"$f":"IF(A12=\"\",\"\",P12-'STP2'!AI5-'STP2'!AL5-'STP2'!AO5-'STP2'!AR5)","v":0},{"$f":"IF(A12=\"\",\"\",'STP2'!AT5)","v":0},{"$f":"IF(A12=\"\",\"\",R12-'STP2'!AU5)","v":0},9,{"$f":"IF(A12=\"\",\"\",'STP2'!CD5)","v":0},{"$f":"IF(A12=\"\",\"\",'STP2'!CE5)","v":0},{"$f":"IF(A12=\"\",\"\",'STP2'!CF5)","v":0},{"$f":"IF(A12=\"\",\"\",'STP2'!CG5)","v":1},{"$f":"IF(A12=\"\",\"\",'STP2'!CH5)","v":0},{"$f":"IF(A12=\"\",\"\",'STP2'!CI5)","v":0},{"$f":"IF(A12=\"\",\"\",'STP2'!CJ5)","v":3},{"$f":"IF(A12=\"\",\"\",'STP2'!CK5)","v":4},{"$f":"IF(A12=\"\",\"\",'STP2'!CL5)","v":0},{"$f":"IF(A12=\"\",\"\",'STP2'!CM5)","v":0},8,{"$f":"IF(A12=\"\",\"\",'STP2'!CN5)","v":0},{"$f":"IF(A12=\"\",\"\",'STP2'!CO5)","v":0},{"$f":"IF(A12=\"\",\"\",'STP2'!CP5)","v":0},{"$f":"IF(A12=\"\",\"\",'STP2'!CQ5)","v":0},{"$f":"IF(A12=\"\",\"\",'STP2'!CR5)","v":0},{"$f":"IF(A12=\"\",\"\",'STP2'!CS5)","v":0},{"$f":"IF(A12=\"\",\"\",'STP2'!CT5)","v":0},{"$f":"IF(A12=\"\",\"\",'STP2'!CU5)","v":0},{"$f":"IF(A12=\"\",\"\",'STP2'!CV5)","v":1},{"$f":"IF(A12=\"\",\"\",'STP2'!CW5)","v":0},1,{"$f":"IF(A12=\"\",\"\",'STP2'!CX5)","v":0},{"$f":"IF(A12=\"\",\"\",'STP2'!CY5)","v":0},{"$f":"IF(A12=\"\",\"\",'STP2'!CZ5)","v":0},{"$f":"IF(A12=\"\",\"\",'STP2'!DA5)","v":0},{"$f":"IF(A12=\"\",\"\",'STP2'!DB5)","v":0},{"$f":"IF(A12=\"\",\"\",'STP2'!DC5)","v":0},{"$f":"IF(A12=\"\",\"\",'STP2'!DD5)","v":0},{"$f":"IF(A12=\"\",\"\",'STP2'!DE5)","v":0},{"$f":"IF(A12=\"\",\"\",'STP2'!DF5)","v":0},{"$f":"IF(A12=\"\",\"\",'STP2'!DG5)","v":0},0,{"$f":"IF(A12=\"\",\"\",'STP2'!DH5)","v":0},{"$f":"IF(A12=\"\",\"\",'STP2'!DI5)","v":0},{"$f":"IF(A12=\"\",\"\",'STP2'!DJ5)","v":0},{"$f":"IF(A12=\"\",\"\",'STP2'!DK5)","v":0},{"$f":"IF(A12=\"\",\"\",'STP2'!DL5)","v":0},{"$f":"IF(A12=\"\",\"\",'STP2'!DM5)","v":0},{"$f":"IF(A12=\"\",\"\",'STP2'!DN5)","v":0},{"$f":"IF(A12=\"\",\"\",'STP2'!DO5)","v":0},{"$f":"IF(A12=\"\",\"\",'STP2'!DP5)","v":0},{"$f":"IF(A12=\"\",\"\",'STP2'!DQ5)","v":0},0,{"$f":"IF(A12=\"\",\"\",'STP2'!DR5)","v":0},{"$f":"IF(A12=\"\",\"\",'STP2'!DS5)","v":0},{"$f":"IF(A12=\"\",\"\",'STP2'!DT5)","v":0},{"$f":"IF(A12=\"\",\"\",'STP2'!DU5)","v":0},{"$f":"IF(A12=\"\",\"\",'STP2'!DV5)","v":0},{"$f":"IF(A12=\"\",\"\",'STP2'!DW5)","v":0},{"$f":"IF(A12=\"\",\"\",'STP2'!DX5)","v":0},{"$f":"IF(A12=\"\",\"\",'STP2'!DY5)","v":0},{"$f":"IF(A12=\"\",\"\",'STP2'!DZ5)","v":0},{"$f":"IF(A12=\"\",\"\",'STP2'!EA5)","v":0},0,{"$f":"IF(A12=\"\",\"\",'STP2'!EB5)","v":0},{"$f":"IF(A12=\"\",\"\",'STP2'!EC5)","v":0},{"$f":"IF(A12=\"\",\"\",'STP2'!ED5)","v":0},{"$f":"IF(A12=\"\",\"\",'STP2'!EE5)","v":0},{"$f":"IF(A12=\"\",\"\",'STP2'!EF5)","v":0},{"$f":"IF(A12=\"\",\"\",'STP2'!EG5)","v":0},{"$f":"IF(A12=\"\",\"\",'STP2'!EH5)","v":0},{"$f":"IF(A12=\"\",\"\",'STP2'!EI5)","v":0},{"$f":"IF(A12=\"\",\"\",'STP2'!EJ5)","v":0},{"$f":"IF(A12=\"\",\"\",'STP2'!EK5)","v":0},0,{"$f":"IF('STP2'!$I5<>99,'STP2'!AV5,\"\")","v":5},{"$f":"IF('STP2'!$I5<>99,'STP2'!AW5,\"\")","v":0},{"$f":"IF('STP2'!$I5<>99,'STP2'!AX5,\"\")","v":0}]
[{"$f":"IF('STP2'!I6=\"99\",\"\",'STP2'!I6)","v":"07"},{"$f":"IF(A13=\"\",\"\",'STP2'!J6)","v":"3MS1"},1,{"$f":"IF(A13=\"\",\"\",IF('STP2'!K6,\"ASO\",IF('STP2'!L6,\"SE\",IF('STP2'!M6,\"KB\",IF('STP2'!N6,\"SB\",IF('STP2'!O6,\"SI\",IF('STP2'!P6,\"MB\",\"S\")))))))","v":"ASO"},{"$f":"IF(A13=\"\",\"\",'STP2'!S6)","v":0},{"$f":"IF(A13=\"\",\"\",'STP2'!V6)","v":0},{"$f":"IF(A13=\"\",\"\",'STP2'!Y6)","v":0},{"$f":"IF(A13=\"\",\"\",'STP2'!AB6)","v":0},{"$f":"IF(A13=\"\",\"\",'STP2'!AE6)","v":0},0,{"$f":"IF(A13=\"\",\"\", J13-'STP2'!T6-'STP2'!W6-'STP2'!Z6-'STP2'!AC6-'STP2'!AF6)","v":0},{"$f":"IF(A13=\"\",\"\",'STP2'!AH6)","v":0},{"$f":"IF(A13=\"\",\"\",'STP2'!AK6)","v":0},{"$f":"IF(A13=\"\",\"\",'STP2'!AN6)","v":14},{"$f":"IF(A13=\"\",\"\",'STP2'!AQ6)","v":0},14,{"$f":"IF(A13=\"\",\"\",P13-'STP2'!AI6-'STP2'!AL6-'STP2'!AO6-'STP2'!AR6)","v":5},{"$f":"IF(A13=\"\",\"\",'STP2'!AT6)","v":0},{"$f":"IF(A13=\"\",\"\",R13-'STP2'!AU6)","v":0},14,{"$f":"IF(A13=\"\",\"\",'STP2'!CD6)","v":0},{"$f":"IF(A13=\"\",\"\",'STP2'!CE6)","v":0},{"$f":"IF(A13=\"\",\"\",'STP2'!CF6)","v":0},{"$f":"IF(A13=\"\",\"\",'STP2'!CG6)","v":0},{"$f":"IF(A13=\"\",\"\",'STP2'!CH6)","v":0},{"$f":"IF(A13=\"\",\"\",'STP2'!CI6)","v":0},{"$f":"IF(A13=\"\",\"\",'STP2'!CJ6)","v":0},{"$f":"IF(A13=\"\",\"\",'STP2'!CK6)","v":7},{"$f":"IF(A13=\"\",\"\",'STP2'!CL6)","v":0},{"$f":"IF(A13=\"\",\"\",'STP2'!CM6)","v":0},7,{"$f":"IF(A13=\"\",\"\",'STP2'!CN6)","v":0},{"$f":"IF(A13=\"\",\"\",'STP2'!CO6)","v":0},{"$f":"IF(A13=\"\",\"\",'STP2'!CP6)","v":0},{"$f":"IF(A13=\"\",\"\",'STP2'!CQ6)","v":0},{"$f":"IF(A13=\"\",\"\",'STP2'!CR6)","v":0},{"$f":"IF(A13=\"\",\"\",'STP2'!CS6)","v":0},{"$f":"IF(A13=\"\",\"\",'STP2'!CT6)","v":0},{"$f":"IF(A13=\"\",\"\",'STP2'!CU6)","v":1},{"$f":"IF(A13=\"\",\"\",'STP2'!CV6)","v":0},{"$f":"IF(A13=\"\",\"\",'STP2'!CW6)","v":0},1,{"$f":"IF(A13=\"\",\"\",'STP2'!CX6)","v":0},{"$f":"IF(A13=\"\",\"\",'STP2'!CY6)","v":0},{"$f":"IF(A13=\"\",\"\",'STP2'!CZ6)","v":0},{"$f":"IF(A13=\"\",\"\",'STP2'!DA6)","v":0},{"$f":"IF(A13=\"\",\"\",'STP2'!DB6)","v":0},{"$f":"IF(A13=\"\",\"\",'STP2'!DC6)","v":0},{"$f":"IF(A13=\"\",\"\",'STP2'!DD6)","v":0},{"$f":"IF(A13=\"\",\"\",'STP2'!DE6)","v":0},{"$f":"IF(A13=\"\",\"\",'STP2'!DF6)","v":0},{"$f":"IF(A13=\"\",\"\",'STP2'!DG6)","v":0},0,{"$f":"IF(A13=\"\",\"\",'STP2'!DH6)","v":0},{"$f":"IF(A13=\"\",\"\",'STP2'!DI6)","v":0},{"$f":"IF(A13=\"\",\"\",'STP2'!DJ6)","v":0},{"$f":"IF(A13=\"\",\"\",'STP2'!DK6)","v":0},{"$f":"IF(A13=\"\",\"\",'STP2'!DL6)","v":0},{"$f":"IF(A13=\"\",\"\",'STP2'!DM6)","v":0},{"$f":"IF(A13=\"\",\"\",'STP2'!DN6)","v":0},{"$f":"IF(A13=\"\",\"\",'STP2'!DO6)","v":0},{"$f":"IF(A13=\"\",\"\",'STP2'!DP6)","v":0},{"$f":"IF(A13=\"\",\"\",'STP2'!DQ6)","v":0},0,{"$f":"IF(A13=\"\",\"\",'STP2'!DR6)","v":0},{"$f":"IF(A13=\"\",\"\",'STP2'!DS6)","v":0},{"$f":"IF(A13=\"\",\"\",'STP2'!DT6)","v":0},{"$f":"IF(A13=\"\",\"\",'STP2'!DU6)","v":0},{"$f":"IF(A13=\"\",\"\",'STP2'!DV6)","v":0},{"$f":"IF(A13=\"\",\"\",'STP2'!DW6)","v":0},{"$f":"IF(A13=\"\",\"\",'STP2'!DX6)","v":0},{"$f":"IF(A13=\"\",\"\",'STP2'!DY6)","v":0},{"$f":"IF(A13=\"\",\"\",'STP2'!DZ6)","v":0},{"$f":"IF(A13=\"\",\"\",'STP2'!EA6)","v":0},0,{"$f":"IF(A13=\"\",\"\",'STP2'!EB6)","v":0},{"$f":"IF(A13=\"\",\"\",'STP2'!EC6)","v":0},{"$f":"IF(A13=\"\",\"\",'STP2'!ED6)","v":0},{"$f":"IF(A13=\"\",\"\",'STP2'!EE6)","v":0},{"$f":"IF(A13=\"\",\"\",'STP2'!EF6)","v":0},{"$f":"IF(A13=\"\",\"\",'STP2'!EG6)","v":0},{"$f":"IF(A13=\"\",\"\",'STP2'!EH6)","v":0},{"$f":"IF(A13=\"\",\"\",'STP2'!EI6)","v":0},{"$f":"IF(A13=\"\",\"\",'STP2'!EJ6)","v":0},{"$f":"IF(A13=\"\",\"\",'STP2'!EK6)","v":0},0,{"$f":"IF(A9=\"\",\"\",'STP2'!AV6)","v":13},{"$f":"IF(A9=\"\",\"\",'STP2'!AW6)","v":0},{"$f":"IF(A9=\"\",\"\",'STP2'!AX6)","v":0}]
[{"$f":"IF('STP2'!I7=\"99\",\"\",'STP2'!I7)","v":"08"},{"$f":"IF(A14=\"\",\"\",'STP2'!J7)","v":"1LOK"},4,{"$f":"IF(A14=\"\",\"\",IF('STP2'!K7,\"ASO\",IF('STP2'!L7,\"SE\",IF('STP2'!M7,\"KB\",IF('STP2'!N7,\"SB\",IF('STP2'!O7,\"SI\",IF('STP2'!P7,\"MB\",\"S\")))))))","v":"ASO"},{"$f":"IF(A14=\"\",\"\",'STP2'!S7)","v":0},{"$f":"IF(A14=\"\",\"\",'STP2'!V7)","v":0},{"$f":"IF(A14=\"\",\"\",'STP2'!Y7)","v":0},{"$f":"IF(A14=\"\",\"\",'STP2'!AB7)","v":0},{"$f":"IF(A14=\"\",\"\",'STP2'!AE7)","v":0},0,{"$f":"IF(A14=\"\",\"\", J14-'STP2'!T7-'STP2'!W7-'STP2'!Z7-'STP2'!AC7-'STP2'!AF7)","v":0},{"$f":"IF(A14=\"\",\"\",'STP2'!AH7)","v":1},{"$f":"IF(A14=\"\",\"\",'STP2'!AK7)","v":1},{"$f":"IF(A14=\"\",\"\",'STP2'!AN7)","v":4},{"$f":"IF(A14=\"\",\"\",'STP2'!AQ7)","v":0},6,{"$f":"IF(A14=\"\",\"\",P14-'STP2'!AI7-'STP2'!AL7-'STP2'!AO7-'STP2'!AR7)","v":0},{"$f":"IF(A14=\"\",\"\",'STP2'!AT7)","v":2},{"$f":"IF(A14=\"\",\"\",R14-'STP2'!AU7)","v":0},8,{"$f":"IF(A14=\"\",\"\",'STP2'!CD7)","v":0},{"$f":"IF(A14=\"\",\"\",'STP2'!CE7)","v":0},{"$f":"IF(A14=\"\",\"\",'STP2'!CF7)","v":0},{"$f":"IF(A14=\"\",\"\",'STP2'!CG7)","v":0},{"$f":"IF(A14=\"\",\"\",'STP2'!CH7)","v":0},{"$f":"IF(A14=\"\",\"\",'STP2'!CI7)","v":1},{"$f":"IF(A14=\"\",\"\",'STP2'!CJ7)","v":1},{"$f":"IF(A14=\"\",\"\",'STP2'!CK7)","v":3},{"$f":"IF(A14=\"\",\"\",'STP2'!CL7)","v":0},{"$f":"IF(A14=\"\",\"\",'STP2'!CM7)","v":0},5,{"$f":"IF(A14=\"\",\"\",'STP2'!CN7)","v":0},{"$f":"IF(A14=\"\",\"\",'STP2'!CO7)","v":0},{"$f":"IF(A14=\"\",\"\",'STP2'!CP7)","v":0},{"$f":"IF(A14=\"\",\"\",'STP2'!CQ7)","v":0},{"$f":"IF(A14=\"\",\"\",'STP2'!CR7)","v":0},{"$f":"IF(A14=\"\",\"\",'STP2'!CS7)","v":0},{"$f":"IF(A14=\"\",\"\",'STP2'!CT7)","v":0},{"$f":"IF(A14=\"\",\"\",'STP2'!CU7)","v":1},{"$f":"IF(A14=\"\",\"\",'STP2'!CV7)","v":0},{"$f":"IF(A14=\"\",\"\",'STP2'!CW7)","v":0},1,{"$f":"IF(A14=\"\",\"\",'STP2'!CX7)","v":0},{"$f":"IF(A14=\"\",\"\",'STP2'!CY7)","v":0},{"$f":"IF(A14=\"\",\"\",'STP2'!CZ7)","v":0},{"$f":"IF(A14=\"\",\"\",'STP2'!DA7)","v":0},{"$f":"IF(A14=\"\",\"\",'STP2'!DB7)","v":0},{"$f":"IF(A14=\"\",\"\",'STP2'!DC7)","v":0},{"$f":"IF(A14=\"\",\"\",'STP2'!DD7)","v":0},{"$f":"IF(A14=\"\",\"\",'STP2'!DE7)","v":0},{"$f":"IF(A14=\"\",\"\",'STP2'!DF7)","v":0},{"$f":"IF(A14=\"\",\"\",'STP2'!DG7)","v":2},2,{"$f":"IF(A14=\"\",\"\",'STP2'!DH7)","v":0},{"$f":"IF(A14=\"\",\"\",'STP2'!DI7)","v":0},{"$f":"IF(A14=\"\",\"\",'STP2'!DJ7)","v":0},{"$f":"IF(A14=\"\",\"\",'STP2'!DK7)","v":0},{"$f":"IF(A14=\"\",\"\",'STP2'!DL7)","v":0},{"$f":"IF(A14=\"\",\"\",'STP2'!DM7)","v":0},{"$f":"IF(A14=\"\",\"\",'STP2'!DN7)","v":0},{"$f":"IF(A14=\"\",\"\",'STP2'!DO7)","v":0},{"$f":"IF(A14=\"\",\"\",'STP2'!DP7)","v":0},{"$f":"IF(A14=\"\",\"\",'STP2'!DQ7)","v":0},0,{"$f":"IF(A14=\"\",\"\",'STP2'!DR7)","v":0},{"$f":"IF(A14=\"\",\"\",'STP2'!DS7)","v":0},{"$f":"IF(A14=\"\",\"\",'STP2'!DT7)","v":0},{"$f":"IF(A14=\"\",\"\",'STP2'!DU7)","v":0},{"$f":"IF(A14=\"\",\"\",'STP2'!DV7)","v":0},{"$f":"IF(A14=\"\",\"\",'STP2'!DW7)","v":0},{"$f":"IF(A14=\"\",\"\",'STP2'!DX7)","v":0},{"$f":"IF(A14=\"\",\"\",'STP2'!DY7)","v":0},{"$f":"IF(A14=\"\",\"\",'STP2'!DZ7)","v":0},{"$f":"IF(A14=\"\",\"\",'STP2'!EA7)","v":0},0,{"$f":"IF(A14=\"\",\"\",'STP2'!EB7)","v":0},{"$f":"IF(A14=\"\",\"\",'STP2'!EC7)","v":0},{"$f":"IF(A14=\"\",\"\",'STP2'!ED7)","v":0},{"$f":"IF(A14=\"\",\"\",'STP2'!EE7)","v":0},{"$f":"IF(A14=\"\",\"\",'STP2'!EF7)","v":0},{"$f":"IF(A14=\"\",\"\",'STP2'!EG7)","v":0},{"$f":"IF(A14=\"\",\"\",'STP2'!EH7)","v":0},{"$f":"IF(A14=\"\",\"\",'STP2'!EI7)","v":0},{"$f":"IF(A14=\"\",\"\",'STP2'!EJ7)","v":0},{"$f":"IF(A14=\"\",\"\",'STP2'!EK7)","v":0},0,{"$f":"IF(A10=\"\",\"\",'STP2'!AV7)","v":7},{"$f":"IF(A10=\"\",\"\",'STP2'!AW7)","v":0},{"$f":"IF(A10=\"\",\"\",'STP2'!AX7)","v":0}]
[{"$f":"IF('STP2'!I8=\"99\",\"\",'STP2'!I8)","v":"08"},{"$f":"IF(A15=\"\",\"\",'STP2'!J8)","v":"2fam1"},6,{"$f":"IF(A15=\"\",\"\",IF('STP2'!K8,\"ASO\",IF('STP2'!L8,\"SE\",IF('STP2'!M8,\"KB\",IF('STP2'!N8,\"SB\",IF('STP2'!O8,\"SI\",IF('STP2'!P8,\"MB\",\"S\")))))))","v":"SB"},{"$f":"IF(A15=\"\",\"\",'STP2'!S8)","v":0},{"$f":"IF(A15=\"\",\"\",'STP2'!V8)","v":0},{"$f":"IF(A15=\"\",\"\",'STP2'!Y8)","v":0},{"$f":"IF(A15=\"\",\"\",'STP2'!AB8)","v":1},{"$f":"IF(A15=\"\",\"\",'STP2'!AE8)","v":1},2,{"$f":"IF(A15=\"\",\"\", J15-'STP2'!T8-'STP2'!W8-'STP2'!Z8-'STP2'!AC8-'STP2'!AF8)","v":0},{"$f":"IF(A15=\"\",\"\",'STP2'!AH8)","v":0},{"$f":"IF(A15=\"\",\"\",'STP2'!AK8)","v":3},{"$f":"IF(A15=\"\",\"\",'STP2'!AN8)","v":2},{"$f":"IF(A15=\"\",\"\",'STP2'!AQ8)","v":2},7,{"$f":"IF(A15=\"\",\"\",P15-'STP2'!AI8-'STP2'!AL8-'STP2'!AO8-'STP2'!AR8)","v":0},{"$f":"IF(A15=\"\",\"\",'STP2'!AT8)","v":1},{"$f":"IF(A15=\"\",\"\",R15-'STP2'!AU8)","v":0},10,{"$f":"IF(A15=\"\",\"\",'STP2'!CD8)","v":0},{"$f":"IF(A15=\"\",\"\",'STP2'!CE8)","v":0},{"$f":"IF(A15=\"\",\"\",'STP2'!CF8)","v":0},{"$f":"IF(A15=\"\",\"\",'STP2'!CG8)","v":1},{"$f":"IF(A15=\"\",\"\",'STP2'!CH8)","v":1},{"$f":"IF(A15=\"\",\"\",'STP2'!CI8)","v":0},{"$f":"IF(A15=\"\",\"\",'STP2'!CJ8)","v":1},{"$f":"IF(A15=\"\",\"\",'STP2'!CK8)","v":0},{"$f":"IF(A15=\"\",\"\",'STP2'!CL8)","v":0},{"$f":"IF(A15=\"\",\"\",'STP2'!CM8)","v":0},3,{"$f":"IF(A15=\"\",\"\",'STP2'!CN8)","v":0},{"$f":"IF(A15=\"\",\"\",'STP2'!CO8)","v":0},{"$f":"IF(A15=\"\",\"\",'STP2'!CP8)","v":0},{"$f":"IF(A15=\"\",\"\",'STP2'!CQ8)","v":0},{"$f":"IF(A15=\"\",\"\",'STP2'!CR8)","v":0},{"$f":"IF(A15=\"\",\"\",'STP2'!CS8)","v":0},{"$f":"IF(A15=\"\",\"\",'STP2'!CT8)","v":0},{"$f":"IF(A15=\"\",\"\",'STP2'!CU8)","v":0},{"$f":"IF(A15=\"\",\"\",'STP2'!CV8)","v":0},{"$f":"IF(A15=\"\",\"\",'STP2'!CW8)","v":0},0,{"$f":"IF(A15=\"\",\"\",'STP2'!CX8)","v":0},{"$f":"IF(A15=\"\",\"\",'STP2'!CY8)","v":0},{"$f":"IF(A15=\"\",\"\",'STP2'!CZ8)","v":0},{"$f":"IF(A15=\"\",\"\",'STP2'!DA8)","v":0},{"$f":"IF(A15=\"\",\"\",'STP2'!DB8)","v":0},{"$f":"IF(A15=\"\",\"\",'STP2'!DC8)","v":0},{"$f":"IF(A15=\"\",\"\",'STP2'!DD8)","v":2},{"$f":"IF(A15=\"\",\"\",'STP2'!DE8)","v":2},{"$f":"IF(A15=\"\",\"\",'STP2'!DF8)","v":2},{"$f":"IF(A15=\"\",\"\",'STP2'!DG8)","v":1},7,{"$f":"IF(A15=\"\",\"\",'STP2'!DH8)","v":0},{"$f":"IF(A15=\"\",\"\",'STP2'!DI8)","v":0},{"$f":"IF(A15=\"\",\"\",'STP2'!DJ8)","v":0},{"$f":"IF(A15=\"\",\"\",'STP2'!DK8)","v":0},{"$f":"IF(A15=\"\",\"\",'STP2'!DL8)","v":0},{"$f":"IF(A15=\"\",\"\",'STP2'!DM8)","v":0},{"$f":"IF(A15=\"\",\"\",'STP2'!DN8)","v":0},{"$f":"IF(A15=\"\",\"\",'STP2'!DO8)","v":0},{"$f":"IF(A15=\"\",\"\",'STP2'!DP8)","v":0},{"$f":"IF(A15=\"\",\"\",'STP2'!DQ8)","v":0},0,{"$f":"IF(A15=\"\",\"\",'STP2'!DR8)","v":0},{"$f":"IF(A15=\"\",\"\",'STP2'!DS8)","v":0},{"$f":"IF(A15=\"\",\"\",'STP2'!DT8)","v":0},{"$f":"IF(A15=\"\",\"\",'STP2'!DU8)","v":0},{"$f":"IF(A15=\"\",\"\",'STP2'!DV8)","v":0},{"$f":"IF(A15=\"\",\"\",'STP2'!DW8)","v":0},{"$f":"IF(A15=\"\",\"\",'STP2'!DX8)","v":0},{"$f":"IF(A15=\"\",\"\",'STP2'!DY8)","v":0},{"$f":"IF(A15=\"\",\"\",'STP2'!DZ8)","v":0},{"$f":"IF(A15=\"\",\"\",'STP2'!EA8)","v":0},0,{"$f":"IF(A15=\"\",\"\",'STP2'!EB8)","v":0},{"$f":"IF(A15=\"\",\"\",'STP2'!EC8)","v":0},{"$f":"IF(A15=\"\",\"\",'STP2'!ED8)","v":0},{"$f":"IF(A15=\"\",\"\",'STP2'!EE8)","v":0},{"$f":"IF(A15=\"\",\"\",'STP2'!EF8)","v":0},{"$f":"IF(A15=\"\",\"\",'STP2'!EG8)","v":0},{"$f":"IF(A15=\"\",\"\",'STP2'!EH8)","v":0},{"$f":"IF(A15=\"\",\"\",'STP2'!EI8)","v":0},{"$f":"IF(A15=\"\",\"\",'STP2'!EJ8)","v":0},{"$f":"IF(A15=\"\",\"\",'STP2'!EK8)","v":0},0,{"$f":"IF(A11=\"\",\"\",'STP2'!AV8)","v":5},{"$f":"IF(A11=\"\",\"\",'STP2'!AW8)","v":0},{"$f":"IF(A11=\"\",\"\",'STP2'!AX8)","v":0}]
[{"$f":"IF('STP2'!I9=\"99\",\"\",'STP2'!I9)","v":"08"},{"$f":"IF(A16=\"\",\"\",'STP2'!J9)","v":"2fam2"},4,{"$f":"IF(A16=\"\",\"\",IF('STP2'!K9,\"ASO\",IF('STP2'!L9,\"SE\",IF('STP2'!M9,\"KB\",IF('STP2'!N9,\"SB\",IF('STP2'!O9,\"SI\",IF('STP2'!P9,\"MB\",\"S\")))))))","v":"SB"},{"$f":"IF(A16=\"\",\"\",'STP2'!S9)","v":0},{"$f":"IF(A16=\"\",\"\",'STP2'!V9)","v":0},{"$f":"IF(A16=\"\",\"\",'STP2'!Y9)","v":0},{"$f":"IF(A16=\"\",\"\",'STP2'!AB9)","v":2},{"$f":"IF(A16=\"\",\"\",'STP2'!AE9)","v":3},5,{"$f":"IF(A16=\"\",\"\", J16-'STP2'!T9-'STP2'!W9-'STP2'!Z9-'STP2'!AC9-'STP2'!AF9)","v":0},{"$f":"IF(A16=\"\",\"\",'STP2'!AH9)","v":1},{"$f":"IF(A16=\"\",\"\",'STP2'!AK9)","v":5},{"$f":"IF(A16=\"\",\"\",'STP2'!AN9)","v":0},{"$f":"IF(A16=\"\",\"\",'STP2'!AQ9)","v":0},6,{"$f":"IF(A16=\"\",\"\",P16-'STP2'!AI9-'STP2'!AL9-'STP2'!AO9-'STP2'!AR9)","v":0},{"$f":"IF(A16=\"\",\"\",'STP2'!AT9)","v":0},{"$f":"IF(A16=\"\",\"\",R16-'STP2'!AU9)","v":0},11,{"$f":"IF(A16=\"\",\"\",'STP2'!CD9)","v":0},{"$f":"IF(A16=\"\",\"\",'STP2'!CE9)","v":0},{"$f":"IF(A16=\"\",\"\",'STP2'!CF9)","v":0},{"$f":"IF(A16=\"\",\"\",'STP2'!CG9)","v":1},{"$f":"IF(A16=\"\",\"\",'STP2'!CH9)","v":3},{"$f":"IF(A16=\"\",\"\",'STP2'!CI9)","v":1},{"$f":"IF(A16=\"\",\"\",'STP2'!CJ9)","v":2},{"$f":"IF(A16=\"\",\"\",'STP2'!CK9)","v":0},{"$f":"IF(A16=\"\",\"\",'STP2'!CL9)","v":0},{"$f":"IF(A16=\"\",\"\",'STP2'!CM9)","v":0},7,{"$f":"IF(A16=\"\",\"\",'STP2'!CN9)","v":0},{"$f":"IF(A16=\"\",\"\",'STP2'!CO9)","v":0},{"$f":"IF(A16=\"\",\"\",'STP2'!CP9)","v":0},{"$f":"IF(A16=\"\",\"\",'STP2'!CQ9)","v":0},{"$f":"IF(A16=\"\",\"\",'STP2'!CR9)","v":0},{"$f":"IF(A16=\"\",\"\",'STP2'!CS9)","v":0},{"$f":"IF(A16=\"\",\"\",'STP2'!CT9)","v":1},{"$f":"IF(A16=\"\",\"\",'STP2'!CU9)","v":0},{"$f":"IF(A16=\"\",\"\",'STP2'!CV9)","v":0},{"$f":"IF(A16=\"\",\"\",'STP2'!CW9)","v":0},1,{"$f":"IF(A16=\"\",\"\",'STP2'!CX9)","v":0},{"$f":"IF(A16=\"\",\"\",'STP2'!CY9)","v":0},{"$f":"IF(A16=\"\",\"\",'STP2'!CZ9)","v":0},{"$f":"IF(A16=\"\",\"\",'STP2'!DA9)","v":1},{"$f":"IF(A16=\"\",\"\",'STP2'!DB9)","v":0},{"$f":"IF(A16=\"\",\"\",'STP2'!DC9)","v":0},{"$f":"IF(A16=\"\",\"\",'STP2'!DD9)","v":2},{"$f":"IF(A16=\"\",\"\",'STP2'!DE9)","v":0},{"$f":"IF(A16=\"\",\"\",'STP2'!DF9)","v":0},{"$f":"IF(A16=\"\",\"\",'STP2'!DG9)","v":0},3,{"$f":"IF(A16=\"\",\"\",'STP2'!DH9)","v":0},{"$f":"IF(A16=\"\",\"\",'STP2'!DI9)","v":0},{"$f":"IF(A16=\"\",\"\",'STP2'!DJ9)","v":0},{"$f":"IF(A16=\"\",\"\",'STP2'!DK9)","v":0},{"$f":"IF(A16=\"\",\"\",'STP2'!DL9)","v":0},{"$f":"IF(A16=\"\",\"\",'STP2'!DM9)","v":0},{"$f":"IF(A16=\"\",\"\",'STP2'!DN9)","v":0},{"$f":"IF(A16=\"\",\"\",'STP2'!DO9)","v":0},{"$f":"IF(A16=\"\",\"\",'STP2'!DP9)","v":0},{"$f":"IF(A16=\"\",\"\",'STP2'!DQ9)","v":0},0,{"$f":"IF(A16=\"\",\"\",'STP2'!DR9)","v":0},{"$f":"IF(A16=\"\",\"\",'STP2'!DS9)","v":0},{"$f":"IF(A16=\"\",\"\",'STP2'!DT9)","v":0},{"$f":"IF(A16=\"\",\"\",'STP2'!DU9)","v":0},{"$f":"IF(A16=\"\",\"\",'STP2'!DV9)","v":0},{"$f":"IF(A16=\"\",\"\",'STP2'!DW9)","v":0},{"$f":"IF(A16=\"\",\"\",'STP2'!DX9)","v":0},{"$f":"IF(A16=\"\",\"\",'STP2'!DY9)","v":0},{"$f":"IF(A16=\"\",\"\",'STP2'!DZ9)","v":0},{"$f":"IF(A16=\"\",\"\",'STP2'!EA9)","v":0},0,{"$f":"IF(A16=\"\",\"\",'STP2'!EB9)","v":0},{"$f":"IF(A16=\"\",\"\",'STP2'!EC9)","v":0},{"$f":"IF(A16=\"\",\"\",'STP2'!ED9)","v":0},{"$f":"IF(A16=\"\",\"\",'STP2'!EE9)","v":0},{"$f":"IF(A16=\"\",\"\",'STP2'!EF9)","v":0},{"$f":"IF(A16=\"\",\"\",'STP2'!EG9)","v":0},{"$f":"IF(A16=\"\",\"\",'STP2'!EH9)","v":0},{"$f":"IF(A16=\"\",\"\",'STP2'!EI9)","v":0},{"$f":"IF(A16=\"\",\"\",'STP2'!EJ9)","v":0},{"$f":"IF(A16=\"\",\"\",'STP2'!EK9)","v":0},0,{"$f":"IF(A12=\"\",\"\",'STP2'!AV9)","v":5},{"$f":"IF(A12=\"\",\"\",'STP2'!AW9)","v":0},{"$f":"IF(A12=\"\",\"\",'STP2'!AX9)","v":0}]
[{"$f":"IF('STP2'!I10=\"99\",\"\",'STP2'!I10)","v":"08"},{"$f":"IF(A17=\"\",\"\",'STP2'!J10)","v":"4MS1"},1,{"$f":"IF(A17=\"\",\"\",IF('STP2'!K10,\"ASO\",IF('STP2'!L10,\"SE\",IF('STP2'!M10,\"KB\",IF('STP2'!N10,\"SB\",IF('STP2'!O10,\"SI\",IF('STP2'!P10,\"MB\",\"S\")))))))","v":"ASO"},{"$f":"IF(A17=\"\",\"\",'STP2'!S10)","v":0},{"$f":"IF(A17=\"\",\"\",'STP2'!V10)","v":0},{"$f":"IF(A17=\"\",\"\",'STP2'!Y10)","v":0},{"$f":"IF(A17=\"\",\"\",'STP2'!AB10)","v":0},{"$f":"IF(A17=\"\",\"\",'STP2'!AE10)","v":0},0,{"$f":"IF(A17=\"\",\"\", J17-'STP2'!T10-'STP2'!W10-'STP2'!Z10-'STP2'!AC10-'STP2'!AF10)","v":0},{"$f":"IF(A17=\"\",\"\",'STP2'!AH10)","v":0},{"$f":"IF(A17=\"\",\"\",'STP2'!AK10)","v":0},{"$f":"IF(A17=\"\",\"\",'STP2'!AN10)","v":0},{"$f":"IF(A17=\"\",\"\",'STP2'!AQ10)","v":10},10,{"$f":"IF(A17=\"\",\"\",P17-'STP2'!AI10-'STP2'!AL10-'STP2'!AO10-'STP2'!AR10)","v":3},{"$f":"IF(A17=\"\",\"\",'STP2'!AT10)","v":0},{"$f":"IF(A17=\"\",\"\",R17-'STP2'!AU10)","v":0},10,{"$f":"IF(A17=\"\",\"\",'STP2'!CD10)","v":0},{"$f":"IF(A17=\"\",\"\",'STP2'!CE10)","v":0},{"$f":"IF(A17=\"\",\"\",'STP2'!CF10)","v":0},{"$f":"IF(A17=\"\",\"\",'STP2'!CG10)","v":0},{"$f":"IF(A17=\"\",\"\",'STP2'!CH10)","v":0},{"$f":"IF(A17=\"\",\"\",'STP2'!CI10)","v":0},{"$f":"IF(A17=\"\",\"\",'STP2'!CJ10)","v":0},{"$f":"IF(A17=\"\",\"\",'STP2'!CK10)","v":0},{"$f":"IF(A17=\"\",\"\",'STP2'!CL10)","v":5},{"$f":"IF(A17=\"\",\"\",'STP2'!CM10)","v":0},5,{"$f":"IF(A17=\"\",\"\",'STP2'!CN10)","v":0},{"$f":"IF(A17=\"\",\"\",'STP2'!CO10)","v":0},{"$f":"IF(A17=\"\",\"\",'STP2'!CP10)","v":0},{"$f":"IF(A17=\"\",\"\",'STP2'!CQ10)","v":0},{"$f":"IF(A17=\"\",\"\",'STP2'!CR10)","v":0},{"$f":"IF(A17=\"\",\"\",'STP2'!CS10)","v":0},{"$f":"IF(A17=\"\",\"\",'STP2'!CT10)","v":0},{"$f":"IF(A17=\"\",\"\",'STP2'!CU10)","v":0},{"$f":"IF(A17=\"\",\"\",'STP2'!CV10)","v":3},{"$f":"IF(A17=\"\",\"\",'STP2'!CW10)","v":0},3,{"$f":"IF(A17=\"\",\"\",'STP2'!CX10)","v":0},{"$f":"IF(A17=\"\",\"\",'STP2'!CY10)","v":0},{"$f":"IF(A17=\"\",\"\",'STP2'!CZ10)","v":0},{"$f":"IF(A17=\"\",\"\",'STP2'!DA10)","v":0},{"$f":"IF(A17=\"\",\"\",'STP2'!DB10)","v":0},{"$f":"IF(A17=\"\",\"\",'STP2'!DC10)","v":0},{"$f":"IF(A17=\"\",\"\",'STP2'!DD10)","v":0},{"$f":"IF(A17=\"\",\"\",'STP2'!DE10)","v":0},{"$f":"IF(A17=\"\",\"\",'STP2'!DF10)","v":0},{"$f":"IF(A17=\"\",\"\",'STP2'!DG10)","v":0},0,{"$f":"IF(A17=\"\",\"\",'STP2'!DH10)","v":0},{"$f":"IF(A17=\"\",\"\",'STP2'!DI10)","v":0},{"$f":"IF(A17=\"\",\"\",'STP2'!DJ10)","v":0},{"$f":"IF(A17=\"\",\"\",'STP2'!DK10)","v":0},{"$f":"IF(A17=\"\",\"\",'STP2'!DL10)","v":0},{"$f":"IF(A17=\"\",\"\",'STP2'!DM10)","v":0},{"$f":"IF(A17=\"\",\"\",'STP2'!DN10)","v":0},{"$f":"IF(A17=\"\",\"\",'STP2'!DO10)","v":0},{"$f":"IF(A17=\"\",\"\",'STP2'!DP10)","v":0},{"$f":"IF(A17=\"\",\"\",'STP2'!DQ10)","v":0},0,{"$f":"IF(A17=\"\",\"\",'STP2'!DR10)","v":0},{"$f":"IF(A17=\"\",\"\",'STP2'!DS10)","v":0},{"$f":"IF(A17=\"\",\"\",'STP2'!DT10)","v":0},{"$f":"IF(A17=\"\",\"\",'STP2'!DU10)","v":0},{"$f":"IF(A17=\"\",\"\",'STP2'!DV10)","v":0},{"$f":"IF(A17=\"\",\"\",'STP2'!DW10)","v":0},{"$f":"IF(A17=\"\",\"\",'STP2'!DX10)","v":0},{"$f":"IF(A17=\"\",\"\",'STP2'!DY10)","v":0},{"$f":"IF(A17=\"\",\"\",'STP2'!DZ10)","v":0},{"$f":"IF(A17=\"\",\"\",'STP2'!EA10)","v":0},0,{"$f":"IF(A17=\"\",\"\",'STP2'!EB10)","v":0},{"$f":"IF(A17=\"\",\"\",'STP2'!EC10)","v":0},{"$f":"IF(A17=\"\",\"\",'STP2'!ED10)","v":0},{"$f":"IF(A17=\"\",\"\",'STP2'!EE10)","v":0},{"$f":"IF(A17=\"\",\"\",'STP2'!EF10)","v":0},{"$f":"IF(A17=\"\",\"\",'STP2'!EG10)","v":0},{"$f":"IF(A17=\"\",\"\",'STP2'!EH10)","v":0},{"$f":"IF(A17=\"\",\"\",'STP2'!EI10)","v":0},{"$f":"IF(A17=\"\",\"\",'STP2'!EJ10)","v":0},{"$f":"IF(A17=\"\",\"\",'STP2'!EK10)","v":0},0,{"$f":"IF(A13=\"\",\"\",'STP2'!AV10)","v":6},{"$f":"IF(A13=\"\",\"\",'STP2'!AW10)","v":0},{"$f":"IF(A13=\"\",\"\",'STP2'!AX10)","v":0}]
[{"$f":"IF('STP2'!I11=\"99\",\"\",'STP2'!I11)","v":"09"},{"$f":"IF(A18=\"\",\"\",'STP2'!J11)","v":"1bv1"},1,{"$f":"IF(A18=\"\",\"\",IF('STP2'!K11,\"ASO\",IF('STP2'!L11,\"SE\",IF('STP2'!M11,\"KB\",IF('STP2'!N11,\"SB\",IF('STP2'!O11,\"SI\",IF('STP2'!P11,\"MB\",\"S\")))))))","v":"ASO"},{"$f":"IF(A18=\"\",\"\",'STP2'!S11)","v":0},{"$f":"IF(A18=\"\",\"\",'STP2'!V11)","v":0},{"$f":"IF(A18=\"\",\"\",'STP2'!Y11)","v":0},{"$f":"IF(A18=\"\",\"\",'STP2'!AB11)","v":0},{"$f":"IF(A18=\"\",\"\",'STP2'!AE11)","v":0},0,{"$f":"IF(A18=\"\",\"\", J18-'STP2'!T11-'STP2'!W11-'STP2'!Z11-'STP2'!AC11-'STP2'!AF11)","v":0},{"$f":"IF(A18=\"\",\"\",'STP2'!AH11)","v":0},{"$f":"IF(A18=\"\",\"\",'STP2'!AK11)","v":0},{"$f":"IF(A18=\"\",\"\",'STP2'!AN11)","v":0},{"$f":"IF(A18=\"\",\"\",'STP2'!AQ11)","v":0},0,{"$f":"IF(A18=\"\",\"\",P18-'STP2'!AI11-'STP2'!AL11-'STP2'!AO11-'STP2'!AR11)","v":0},{"$f":"IF(A18=\"\",\"\",'STP2'!AT11)","v":12},{"$f":"IF(A18=\"\",\"\",R18-'STP2'!AU11)","v":0},12,{"$f":"IF(A18=\"\",\"\",'STP2'!CD11)","v":0},{"$f":"IF(A18=\"\",\"\",'STP2'!CE11)","v":0},{"$f":"IF(A18=\"\",\"\",'STP2'!CF11)","v":0},{"$f":"IF(A18=\"\",\"\",'STP2'!CG11)","v":0},{"$f":"IF(A18=\"\",\"\",'STP2'!CH11)","v":0},{"$f":"IF(A18=\"\",\"\",'STP2'!CI11)","v":0},{"$f":"IF(A18=\"\",\"\",'STP2'!CJ11)","v":0},{"$f":"IF(A18=\"\",\"\",'STP2'!CK11)","v":0},{"$f":"IF(A18=\"\",\"\",'STP2'!CL11)","v":0},{"$f":"IF(A18=\"\",\"\",'STP2'!CM11)","v":12},12,{"$f":"IF(A18=\"\",\"\",'STP2'!CN11)","v":0},{"$f":"IF(A18=\"\",\"\",'STP2'!CO11)","v":0},{"$f":"IF(A18=\"\",\"\",'STP2'!CP11)","v":0},{"$f":"IF(A18=\"\",\"\",'STP2'!CQ11)","v":0},{"$f":"IF(A18=\"\",\"\",'STP2'!CR11)","v":0},{"$f":"IF(A18=\"\",\"\",'STP2'!CS11)","v":0},{"$f":"IF(A18=\"\",\"\",'STP2'!CT11)","v":0},{"$f":"IF(A18=\"\",\"\",'STP2'!CU11)","v":0},{"$f":"IF(A18=\"\",\"\",'STP2'!CV11)","v":0},{"$f":"IF(A18=\"\",\"\",'STP2'!CW11)","v":0},0,{"$f":"IF(A18=\"\",\"\",'STP2'!CX11)","v":0},{"$f":"IF(A18=\"\",\"\",'STP2'!CY11)","v":0},{"$f":"IF(A18=\"\",\"\",'STP2'!CZ11)","v":0},{"$f":"IF(A18=\"\",\"\",'STP2'!DA11)","v":0},{"$f":"IF(A18=\"\",\"\",'STP2'!DB11)","v":0},{"$f":"IF(A18=\"\",\"\",'STP2'!DC11)","v":0},{"$f":"IF(A18=\"\",\"\",'STP2'!DD11)","v":0},{"$f":"IF(A18=\"\",\"\",'STP2'!DE11)","v":0},{"$f":"IF(A18=\"\",\"\",'STP2'!DF11)","v":0},{"$f":"IF(A18=\"\",\"\",'STP2'!DG11)","v":0},0,{"$f":"IF(A18=\"\",\"\",'STP2'!DH11)","v":0},{"$f":"IF(A18=\"\",\"\",'STP2'!DI11)","v":0},{"$f":"IF(A18=\"\",\"\",'STP2'!DJ11)","v":0},{"$f":"IF(A18=\"\",\"\",'STP2'!DK11)","v":0},{"$f":"IF(A18=\"\",\"\",'STP2'!DL11)","v":0},{"$f":"IF(A18=\"\",\"\",'STP2'!DM11)","v":0},{"$f":"IF(A18=\"\",\"\",'STP2'!DN11)","v":0},{"$f":"IF(A18=\"\",\"\",'STP2'!DO11)","v":0},{"$f":"IF(A18=\"\",\"\",'STP2'!DP11)","v":0},{"$f":"IF(A18=\"\",\"\",'STP2'!DQ11)","v":0},0,{"$f":"IF(A18=\"\",\"\",'STP2'!DR11)","v":0},{"$f":"IF(A18=\"\",\"\",'STP2'!DS11)","v":0},{"$f":"IF(A18=\"\",\"\",'STP2'!DT11)","v":0},{"$f":"IF(A18=\"\",\"\",'STP2'!DU11)","v":0},{"$f":"IF(A18=\"\",\"\",'STP2'!DV11)","v":0},{"$f":"IF(A18=\"\",\"\",'STP2'!DW11)","v":0},{"$f":"IF(A18=\"\",\"\",'STP2'!DX11)","v":0},{"$f":"IF(A18=\"\",\"\",'STP2'!DY11)","v":0},{"$f":"IF(A18=\"\",\"\",'STP2'!DZ11)","v":0},{"$f":"IF(A18=\"\",\"\",'STP2'!EA11)","v":0},0,{"$f":"IF(A18=\"\",\"\",'STP2'!EB11)","v":0},{"$f":"IF(A18=\"\",\"\",'STP2'!EC11)","v":0},{"$f":"IF(A18=\"\",\"\",'STP2'!ED11)","v":0},{"$f":"IF(A18=\"\",\"\",'STP2'!EE11)","v":0},{"$f":"IF(A18=\"\",\"\",'STP2'!EF11)","v":0},{"$f":"IF(A18=\"\",\"\",'STP2'!EG11)","v":0},{"$f":"IF(A18=\"\",\"\",'STP2'!EH11)","v":0},{"$f":"IF(A18=\"\",\"\",'STP2'!EI11)","v":0},{"$f":"IF(A18=\"\",\"\",'STP2'!EJ11)","v":0},{"$f":"IF(A18=\"\",\"\",'STP2'!EK11)","v":0},0,{"$f":"IF(A14=\"\",\"\",'STP2'!AV11)","v":6},{"$f":"IF(A14=\"\",\"\",'STP2'!AW11)","v":0},{"$f":"IF(A14=\"\",\"\",'STP2'!AX11)","v":0}]
[{"$f":"IF('STP2'!I12=\"99\",\"\",'STP2'!I12)","v":"09"},{"$f":"IF(A19=\"\",\"\",'STP2'!J12)","v":"1bv2"},2,{"$f":"IF(A19=\"\",\"\",IF('STP2'!K12,\"ASO\",IF('STP2'!L12,\"SE\",IF('STP2'!M12,\"KB\",IF('STP2'!N12,\"SB\",IF('STP2'!O12,\"SI\",IF('STP2'!P12,\"MB\",\"S\")))))))","v":"ASO"},{"$f":"IF(A19=\"\",\"\",'STP2'!S12)","v":0},{"$f":"IF(A19=\"\",\"\",'STP2'!V12)","v":0},{"$f":"IF(A19=\"\",\"\",'STP2'!Y12)","v":0},{"$f":"IF(A19=\"\",\"\",'STP2'!AB12)","v":0},{"$f":"IF(A19=\"\",\"\",'STP2'!AE12)","v":0},0,{"$f":"IF(A19=\"\",\"\", J19-'STP2'!T12-'STP2'!W12-'STP2'!Z12-'STP2'!AC12-'STP2'!AF12)","v":0},{"$f":"IF(A19=\"\",\"\",'STP2'!AH12)","v":0},{"$f":"IF(A19=\"\",\"\",'STP2'!AK12)","v":0},{"$f":"IF(A19=\"\",\"\",'STP2'!AN12)","v":0},{"$f":"IF(A19=\"\",\"\",'STP2'!AQ12)","v":1},1,{"$f":"IF(A19=\"\",\"\",P19-'STP2'!AI12-'STP2'!AL12-'STP2'!AO12-'STP2'!AR12)","v":0},{"$f":"IF(A19=\"\",\"\",'STP2'!AT12)","v":9},{"$f":"IF(A19=\"\",\"\",R19-'STP2'!AU12)","v":0},10,{"$f":"IF(A19=\"\",\"\",'STP2'!CD12)","v":0},{"$f":"IF(A19=\"\",\"\",'STP2'!CE12)","v":0},{"$f":"IF(A19=\"\",\"\",'STP2'!CF12)","v":0},{"$f":"IF(A19=\"\",\"\",'STP2'!CG12)","v":0},{"$f":"IF(A19=\"\",\"\",'STP2'!CH12)","v":0},{"$f":"IF(A19=\"\",\"\",'STP2'!CI12)","v":0},{"$f":"IF(A19=\"\",\"\",'STP2'!CJ12)","v":0},{"$f":"IF(A19=\"\",\"\",'STP2'!CK12)","v":0},{"$f":"IF(A19=\"\",\"\",'STP2'!CL12)","v":0},{"$f":"IF(A19=\"\",\"\",'STP2'!CM12)","v":9},9,{"$f":"IF(A19=\"\",\"\",'STP2'!CN12)","v":0},{"$f":"IF(A19=\"\",\"\",'STP2'!CO12)","v":0},{"$f":"IF(A19=\"\",\"\",'STP2'!CP12)","v":0},{"$f":"IF(A19=\"\",\"\",'STP2'!CQ12)","v":0},{"$f":"IF(A19=\"\",\"\",'STP2'!CR12)","v":0},{"$f":"IF(A19=\"\",\"\",'STP2'!CS12)","v":0},{"$f":"IF(A19=\"\",\"\",'STP2'!CT12)","v":0},{"$f":"IF(A19=\"\",\"\",'STP2'!CU12)","v":0},{"$f":"IF(A19=\"\",\"\",'STP2'!CV12)","v":1},{"$f":"IF(A19=\"\",\"\",'STP2'!CW12)","v":0},1,{"$f":"IF(A19=\"\",\"\",'STP2'!CX12)","v":0},{"$f":"IF(A19=\"\",\"\",'STP2'!CY12)","v":0},{"$f":"IF(A19=\"\",\"\",'STP2'!CZ12)","v":0},{"$f":"IF(A19=\"\",\"\",'STP2'!DA12)","v":0},{"$f":"IF(A19=\"\",\"\",'STP2'!DB12)","v":0},{"$f":"IF(A19=\"\",\"\",'STP2'!DC12)","v":0},{"$f":"IF(A19=\"\",\"\",'STP2'!DD12)","v":0},{"$f":"IF(A19=\"\",\"\",'STP2'!DE12)","v":0},{"$f":"IF(A19=\"\",\"\",'STP2'!DF12)","v":0},{"$f":"IF(A19=\"\",\"\",'STP2'!DG12)","v":0},0,{"$f":"IF(A19=\"\",\"\",'STP2'!DH12)","v":0},{"$f":"IF(A19=\"\",\"\",'STP2'!DI12)","v":0},{"$f":"IF(A19=\"\",\"\",'STP2'!DJ12)","v":0},{"$f":"IF(A19=\"\",\"\",'STP2'!DK12)","v":0},{"$f":"IF(A19=\"\",\"\",'STP2'!DL12)","v":0},{"$f":"IF(A19=\"\",\"\",'STP2'!DM12)","v":0},{"$f":"IF(A19=\"\",\"\",'STP2'!DN12)","v":0},{"$f":"IF(A19=\"\",\"\",'STP2'!DO12)","v":0},{"$f":"IF(A19=\"\",\"\",'STP2'!DP12)","v":0},{"$f":"IF(A19=\"\",\"\",'STP2'!DQ12)","v":0},0,{"$f":"IF(A19=\"\",\"\",'STP2'!DR12)","v":0},{"$f":"IF(A19=\"\",\"\",'STP2'!DS12)","v":0},{"$f":"IF(A19=\"\",\"\",'STP2'!DT12)","v":0},{"$f":"IF(A19=\"\",\"\",'STP2'!DU12)","v":0},{"$f":"IF(A19=\"\",\"\",'STP2'!DV12)","v":0},{"$f":"IF(A19=\"\",\"\",'STP2'!DW12)","v":0},{"$f":"IF(A19=\"\",\"\",'STP2'!DX12)","v":0},{"$f":"IF(A19=\"\",\"\",'STP2'!DY12)","v":0},{"$f":"IF(A19=\"\",\"\",'STP2'!DZ12)","v":0},{"$f":"IF(A19=\"\",\"\",'STP2'!EA12)","v":0},0,{"$f":"IF(A19=\"\",\"\",'STP2'!EB12)","v":0},{"$f":"IF(A19=\"\",\"\",'STP2'!EC12)","v":0},{"$f":"IF(A19=\"\",\"\",'STP2'!ED12)","v":0},{"$f":"IF(A19=\"\",\"\",'STP2'!EE12)","v":0},{"$f":"IF(A19=\"\",\"\",'STP2'!EF12)","v":0},{"$f":"IF(A19=\"\",\"\",'STP2'!EG12)","v":0},{"$f":"IF(A19=\"\",\"\",'STP2'!EH12)","v":0},{"$f":"IF(A19=\"\",\"\",'STP2'!EI12)","v":0},{"$f":"IF(A19=\"\",\"\",'STP2'!EJ12)","v":0},{"$f":"IF(A19=\"\",\"\",'STP2'!EK12)","v":0},0,{"$f":"IF(A15=\"\",\"\",'STP2'!AV12)","v":9},{"$f":"IF(A15=\"\",\"\",'STP2'!AW12)","v":0},{"$f":"IF(A15=\"\",\"\",'STP2'!AX12)","v":0}]
[{"$f":"IF('STP2'!I13=\"99\",\"\",'STP2'!I13)","v":"09"},{"$f":"IF(A20=\"\",\"\",'STP2'!J13)","v":"1bv3"},2,{"$f":"IF(A20=\"\",\"\",IF('STP2'!K13,\"ASO\",IF('STP2'!L13,\"SE\",IF('STP2'!M13,\"KB\",IF('STP2'!N13,\"SB\",IF('STP2'!O13,\"SI\",IF('STP2'!P13,\"MB\",\"S\")))))))","v":"ASO"},{"$f":"IF(A20=\"\",\"\",'STP2'!S13)","v":0},{"$f":"IF(A20=\"\",\"\",'STP2'!V13)","v":0},{"$f":"IF(A20=\"\",\"\",'STP2'!Y13)","v":0},{"$f":"IF(A20=\"\",\"\",'STP2'!AB13)","v":0},{"$f":"IF(A20=\"\",\"\",'STP2'!AE13)","v":0},0,{"$f":"IF(A20=\"\",\"\", J20-'STP2'!T13-'STP2'!W13-'STP2'!Z13-'STP2'!AC13-'STP2'!AF13)","v":0},{"$f":"IF(A20=\"\",\"\",'STP2'!AH13)","v":0},{"$f":"IF(A20=\"\",\"\",'STP2'!AK13)","v":0},{"$f":"IF(A20=\"\",\"\",'STP2'!AN13)","v":0},{"$f":"IF(A20=\"\",\"\",'STP2'!AQ13)","v":3},3,{"$f":"IF(A20=\"\",\"\",P20-'STP2'!AI13-'STP2'!AL13-'STP2'!AO13-'STP2'!AR13)","v":0},{"$f":"IF(A20=\"\",\"\",'STP2'!AT13)","v":8},{"$f":"IF(A20=\"\",\"\",R20-'STP2'!AU13)","v":0},11,{"$f":"IF(A20=\"\",\"\",'STP2'!CD13)","v":0},{"$f":"IF(A20=\"\",\"\",'STP2'!CE13)","v":0},{"$f":"IF(A20=\"\",\"\",'STP2'!CF13)","v":0},{"$f":"IF(A20=\"\",\"\",'STP2'!CG13)","v":0},{"$f":"IF(A20=\"\",\"\",'STP2'!CH13)","v":0},{"$f":"IF(A20=\"\",\"\",'STP2'!CI13)","v":0},{"$f":"IF(A20=\"\",\"\",'STP2'!CJ13)","v":0},{"$f":"IF(A20=\"\",\"\",'STP2'!CK13)","v":0},{"$f":"IF(A20=\"\",\"\",'STP2'!CL13)","v":3},{"$f":"IF(A20=\"\",\"\",'STP2'!CM13)","v":8},11,{"$f":"IF(A20=\"\",\"\",'STP2'!CN13)","v":0},{"$f":"IF(A20=\"\",\"\",'STP2'!CO13)","v":0},{"$f":"IF(A20=\"\",\"\",'STP2'!CP13)","v":0},{"$f":"IF(A20=\"\",\"\",'STP2'!CQ13)","v":0},{"$f":"IF(A20=\"\",\"\",'STP2'!CR13)","v":0},{"$f":"IF(A20=\"\",\"\",'STP2'!CS13)","v":0},{"$f":"IF(A20=\"\",\"\",'STP2'!CT13)","v":0},{"$f":"IF(A20=\"\",\"\",'STP2'!CU13)","v":0},{"$f":"IF(A20=\"\",\"\",'STP2'!CV13)","v":0},{"$f":"IF(A20=\"\",\"\",'STP2'!CW13)","v":0},0,{"$f":"IF(A20=\"\",\"\",'STP2'!CX13)","v":0},{"$f":"IF(A20=\"\",\"\",'STP2'!CY13)","v":0},{"$f":"IF(A20=\"\",\"\",'STP2'!CZ13)","v":0},{"$f":"IF(A20=\"\",\"\",'STP2'!DA13)","v":0},{"$f":"IF(A20=\"\",\"\",'STP2'!DB13)","v":0},{"$f":"IF(A20=\"\",\"\",'STP2'!DC13)","v":0},{"$f":"IF(A20=\"\",\"\",'STP2'!DD13)","v":0},{"$f":"IF(A20=\"\",\"\",'STP2'!DE13)","v":0},{"$f":"IF(A20=\"\",\"\",'STP2'!DF13)","v":0},{"$f":"IF(A20=\"\",\"\",'STP2'!DG13)","v":0},0,{"$f":"IF(A20=\"\",\"\",'STP2'!DH13)","v":0},{"$f":"IF(A20=\"\",\"\",'STP2'!DI13)","v":0},{"$f":"IF(A20=\"\",\"\",'STP2'!DJ13)","v":0},{"$f":"IF(A20=\"\",\"\",'STP2'!DK13)","v":0},{"$f":"IF(A20=\"\",\"\",'STP2'!DL13)","v":0},{"$f":"IF(A20=\"\",\"\",'STP2'!DM13)","v":0},{"$f":"IF(A20=\"\",\"\",'STP2'!DN13)","v":0},{"$f":"IF(A20=\"\",\"\",'STP2'!DO13)","v":0},{"$f":"IF(A20=\"\",\"\",'STP2'!DP13)","v":0},{"$f":"IF(A20=\"\",\"\",'STP2'!DQ13)","v":0},0,{"$f":"IF(A20=\"\",\"\",'STP2'!DR13)","v":0},{"$f":"IF(A20=\"\",\"\",'STP2'!DS13)","v":0},{"$f":"IF(A20=\"\",\"\",'STP2'!DT13)","v":0},{"$f":"IF(A20=\"\",\"\",'STP2'!DU13)","v":0},{"$f":"IF(A20=\"\",\"\",'STP2'!DV13)","v":0},{"$f":"IF(A20=\"\",\"\",'STP2'!DW13)","v":0},{"$f":"IF(A20=\"\",\"\",'STP2'!DX13)","v":0},{"$f":"IF(A20=\"\",\"\",'STP2'!DY13)","v":0},{"$f":"IF(A20=\"\",\"\",'STP2'!DZ13)","v":0},{"$f":"IF(A20=\"\",\"\",'STP2'!EA13)","v":0},0,{"$f":"IF(A20=\"\",\"\",'STP2'!EB13)","v":0},{"$f":"IF(A20=\"\",\"\",'STP2'!EC13)","v":0},{"$f":"IF(A20=\"\",\"\",'STP2'!ED13)","v":0},{"$f":"IF(A20=\"\",\"\",'STP2'!EE13)","v":0},{"$f":"IF(A20=\"\",\"\",'STP2'!EF13)","v":0},{"$f":"IF(A20=\"\",\"\",'STP2'!EG13)","v":0},{"$f":"IF(A20=\"\",\"\",'STP2'!EH13)","v":0},{"$f":"IF(A20=\"\",\"\",'STP2'!EI13)","v":0},{"$f":"IF(A20=\"\",\"\",'STP2'!EJ13)","v":0},{"$f":"IF(A20=\"\",\"\",'STP2'!EK13)","v":0},0,{"$f":"IF(A16=\"\",\"\",'STP2'!AV13)","v":9},{"$f":"IF(A16=\"\",\"\",'STP2'!AW13)","v":0},{"$f":"IF(A16=\"\",\"\",'STP2'!AX13)","v":0}]
[{"$f":"IF('STP2'!I14=\"99\",\"\",'STP2'!I14)","v":"09"},{"$f":"IF(A21=\"\",\"\",'STP2'!J14)","v":"1bv4"},2,{"$f":"IF(A21=\"\",\"\",IF('STP2'!K14,\"ASO\",IF('STP2'!L14,\"SE\",IF('STP2'!M14,\"KB\",IF('STP2'!N14,\"SB\",IF('STP2'!O14,\"SI\",IF('STP2'!P14,\"MB\",\"S\")))))))","v":"SB"},{"$f":"IF(A21=\"\",\"\",'STP2'!S14)","v":0},{"$f":"IF(A21=\"\",\"\",'STP2'!V14)","v":0},{"$f":"IF(A21=\"\",\"\",'STP2'!Y14)","v":0},{"$f":"IF(A21=\"\",\"\",'STP2'!AB14)","v":0},{"$f":"IF(A21=\"\",\"\",'STP2'!AE14)","v":0},0,{"$f":"IF(A21=\"\",\"\", J21-'STP2'!T14-'STP2'!W14-'STP2'!Z14-'STP2'!AC14-'STP2'!AF14)","v":0},{"$f":"IF(A21=\"\",\"\",'STP2'!AH14)","v":0},{"$f":"IF(A21=\"\",\"\",'STP2'!AK14)","v":0},{"$f":"IF(A21=\"\",\"\",'STP2'!AN14)","v":0},{"$f":"IF(A21=\"\",\"\",'STP2'!AQ14)","v":4},4,{"$f":"IF(A21=\"\",\"\",P21-'STP2'!AI14-'STP2'!AL14-'STP2'!AO14-'STP2'!AR14)","v":0},{"$f":"IF(A21=\"\",\"\",'STP2'!AT14)","v":4},{"$f":"IF(A21=\"\",\"\",R21-'STP2'!AU14)","v":0},8,{"$f":"IF(A21=\"\",\"\",'STP2'!CD14)","v":0},{"$f":"IF(A21=\"\",\"\",'STP2'!CE14)","v":0},{"$f":"IF(A21=\"\",\"\",'STP2'!CF14)","v":0},{"$f":"IF(A21=\"\",\"\",'STP2'!CG14)","v":0},{"$f":"IF(A21=\"\",\"\",'STP2'!CH14)","v":0},{"$f":"IF(A21=\"\",\"\",'STP2'!CI14)","v":0},{"$f":"IF(A21=\"\",\"\",'STP2'!CJ14)","v":0},{"$f":"IF(A21=\"\",\"\",'STP2'!CK14)","v":0},{"$f":"IF(A21=\"\",\"\",'STP2'!CL14)","v":0},{"$f":"IF(A21=\"\",\"\",'STP2'!CM14)","v":0},0,{"$f":"IF(A21=\"\",\"\",'STP2'!CN14)","v":0},{"$f":"IF(A21=\"\",\"\",'STP2'!CO14)","v":0},{"$f":"IF(A21=\"\",\"\",'STP2'!CP14)","v":0},{"$f":"IF(A21=\"\",\"\",'STP2'!CQ14)","v":0},{"$f":"IF(A21=\"\",\"\",'STP2'!CR14)","v":0},{"$f":"IF(A21=\"\",\"\",'STP2'!CS14)","v":0},{"$f":"IF(A21=\"\",\"\",'STP2'!CT14)","v":0},{"$f":"IF(A21=\"\",\"\",'STP2'!CU14)","v":0},{"$f":"IF(A21=\"\",\"\",'STP2'!CV14)","v":0},{"$f":"IF(A21=\"\",\"\",'STP2'!CW14)","v":0},0,{"$f":"IF(A21=\"\",\"\",'STP2'!CX14)","v":0},{"$f":"IF(A21=\"\",\"\",'STP2'!CY14)","v":0},{"$f":"IF(A21=\"\",\"\",'STP2'!CZ14)","v":0},{"$f":"IF(A21=\"\",\"\",'STP2'!DA14)","v":0},{"$f":"IF(A21=\"\",\"\",'STP2'!DB14)","v":0},{"$f":"IF(A21=\"\",\"\",'STP2'!DC14)","v":0},{"$f":"IF(A21=\"\",\"\",'STP2'!DD14)","v":0},{"$f":"IF(A21=\"\",\"\",'STP2'!DE14)","v":0},{"$f":"IF(A21=\"\",\"\",'STP2'!DF14)","v":4},{"$f":"IF(A21=\"\",\"\",'STP2'!DG14)","v":4},8,{"$f":"IF(A21=\"\",\"\",'STP2'!DH14)","v":0},{"$f":"IF(A21=\"\",\"\",'STP2'!DI14)","v":0},{"$f":"IF(A21=\"\",\"\",'STP2'!DJ14)","v":0},{"$f":"IF(A21=\"\",\"\",'STP2'!DK14)","v":0},{"$f":"IF(A21=\"\",\"\",'STP2'!DL14)","v":0},{"$f":"IF(A21=\"\",\"\",'STP2'!DM14)","v":0},{"$f":"IF(A21=\"\",\"\",'STP2'!DN14)","v":0},{"$f":"IF(A21=\"\",\"\",'STP2'!DO14)","v":0},{"$f":"IF(A21=\"\",\"\",'STP2'!DP14)","v":0},{"$f":"IF(A21=\"\",\"\",'STP2'!DQ14)","v":0},0,{"$f":"IF(A21=\"\",\"\",'STP2'!DR14)","v":0},{"$f":"IF(A21=\"\",\"\",'STP2'!DS14)","v":0},{"$f":"IF(A21=\"\",\"\",'STP2'!DT14)","v":0},{"$f":"IF(A21=\"\",\"\",'STP2'!DU14)","v":0},{"$f":"IF(A21=\"\",\"\",'STP2'!DV14)","v":0},{"$f":"IF(A21=\"\",\"\",'STP2'!DW14)","v":0},{"$f":"IF(A21=\"\",\"\",'STP2'!DX14)","v":0},{"$f":"IF(A21=\"\",\"\",'STP2'!DY14)","v":0},{"$f":"IF(A21=\"\",\"\",'STP2'!DZ14)","v":0},{"$f":"IF(A21=\"\",\"\",'STP2'!EA14)","v":0},0,{"$f":"IF(A21=\"\",\"\",'STP2'!EB14)","v":0},{"$f":"IF(A21=\"\",\"\",'STP2'!EC14)","v":0},{"$f":"IF(A21=\"\",\"\",'STP2'!ED14)","v":0},{"$f":"IF(A21=\"\",\"\",'STP2'!EE14)","v":0},{"$f":"IF(A21=\"\",\"\",'STP2'!EF14)","v":0},{"$f":"IF(A21=\"\",\"\",'STP2'!EG14)","v":0},{"$f":"IF(A21=\"\",\"\",'STP2'!EH14)","v":0},{"$f":"IF(A21=\"\",\"\",'STP2'!EI14)","v":0},{"$f":"IF(A21=\"\",\"\",'STP2'!EJ14)","v":0},{"$f":"IF(A21=\"\",\"\",'STP2'!EK14)","v":0},0,{"$f":"IF(A17=\"\",\"\",'STP2'!AV14)","v":6},{"$f":"IF(A17=\"\",\"\",'STP2'!AW14)","v":0},{"$f":"IF(A17=\"\",\"\",'STP2'!AX14)","v":0}]
[{"$f":"IF('STP2'!I15=\"99\",\"\",'STP2'!I15)","v":"09"},{"$f":"IF(A22=\"\",\"\",'STP2'!J15)","v":"1bv5"},2,{"$f":"IF(A22=\"\",\"\",IF('STP2'!K15,\"ASO\",IF('STP2'!L15,\"SE\",IF('STP2'!M15,\"KB\",IF('STP2'!N15,\"SB\",IF('STP2'!O15,\"SI\",IF('STP2'!P15,\"MB\",\"S\")))))))","v":"SB"},{"$f":"IF(A22=\"\",\"\",'STP2'!S15)","v":0},{"$f":"IF(A22=\"\",\"\",'STP2'!V15)","v":0},{"$f":"IF(A22=\"\",\"\",'STP2'!Y15)","v":0},{"$f":"IF(A22=\"\",\"\",'STP2'!AB15)","v":0},{"$f":"IF(A22=\"\",\"\",'STP2'!AE15)","v":0},0,{"$f":"IF(A22=\"\",\"\", J22-'STP2'!T15-'STP2'!W15-'STP2'!Z15-'STP2'!AC15-'STP2'!AF15)","v":0},{"$f":"IF(A22=\"\",\"\",'STP2'!AH15)","v":0},{"$f":"IF(A22=\"\",\"\",'STP2'!AK15)","v":0},{"$f":"IF(A22=\"\",\"\",'STP2'!AN15)","v":0},{"$f":"IF(A22=\"\",\"\",'STP2'!AQ15)","v":1},1,{"$f":"IF(A22=\"\",\"\",P22-'STP2'!AI15-'STP2'!AL15-'STP2'!AO15-'STP2'!AR15)","v":0},{"$f":"IF(A22=\"\",\"\",'STP2'!AT15)","v":6},{"$f":"IF(A22=\"\",\"\",R22-'STP2'!AU15)","v":0},7,{"$f":"IF(A22=\"\",\"\",'STP2'!CD15)","v":0},{"$f":"IF(A22=\"\",\"\",'STP2'!CE15)","v":0},{"$f":"IF(A22=\"\",\"\",'STP2'!CF15)","v":0},{"$f":"IF(A22=\"\",\"\",'STP2'!CG15)","v":0},{"$f":"IF(A22=\"\",\"\",'STP2'!CH15)","v":0},{"$f":"IF(A22=\"\",\"\",'STP2'!CI15)","v":0},{"$f":"IF(A22=\"\",\"\",'STP2'!CJ15)","v":0},{"$f":"IF(A22=\"\",\"\",'STP2'!CK15)","v":0},{"$f":"IF(A22=\"\",\"\",'STP2'!CL15)","v":0},{"$f":"IF(A22=\"\",\"\",'STP2'!CM15)","v":0},0,{"$f":"IF(A22=\"\",\"\",'STP2'!CN15)","v":0},{"$f":"IF(A22=\"\",\"\",'STP2'!CO15)","v":0},{"$f":"IF(A22=\"\",\"\",'STP2'!CP15)","v":0},{"$f":"IF(A22=\"\",\"\",'STP2'!CQ15)","v":0},{"$f":"IF(A22=\"\",\"\",'STP2'!CR15)","v":0},{"$f":"IF(A22=\"\",\"\",'STP2'!CS15)","v":0},{"$f":"IF(A22=\"\",\"\",'STP2'!CT15)","v":0},{"$f":"IF(A22=\"\",\"\",'STP2'!CU15)","v":0},{"$f":"IF(A22=\"\",\"\",'STP2'!CV15)","v":0},{"$f":"IF(A22=\"\",\"\",'STP2'!CW15)","v":0},0,{"$f":"IF(A22=\"\",\"\",'STP2'!CX15)","v":0},{"$f":"IF(A22=\"\",\"\",'STP2'!CY15)","v":0},{"$f":"IF(A22=\"\",\"\",'STP2'!CZ15)","v":0},{"$f":"IF(A22=\"\",\"\",'STP2'!DA15)","v":0},{"$f":"IF(A22=\"\",\"\",'STP2'!DB15)","v":0},{"$f":"IF(A22=\"\",\"\",'STP2'!DC15)","v":0},{"$f":"IF(A22=\"\",\"\",'STP2'!DD15)","v":0},{"$f":"IF(A22=\"\",\"\",'STP2'!DE15)","v":0},{"$f":"IF(A22=\"\",\"\",'STP2'!DF15)","v":1},{"$f":"IF(A22=\"\",\"\",'STP2'!DG15)","v":6},7,{"$f":"IF(A22=\"\",\"\",'STP2'!DH15)","v":0},{"$f":"IF(A22=\"\",\"\",'STP2'!DI15)","v":0},{"$f":"IF(A22=\"\",\"\",'STP2'!DJ15)","v":0},{"$f":"IF(A22=\"\",\"\",'STP2'!DK15)","v":0},{"$f":"IF(A22=\"\",\"\",'STP2'!DL15)","v":0},{"$f":"IF(A22=\"\",\"\",'STP2'!DM15)","v":0},{"$f":"IF(A22=\"\",\"\",'STP2'!DN15)","v":0},{"$f":"IF(A22=\"\",\"\",'STP2'!DO15)","v":0},{"$f":"IF(A22=\"\",\"\",'STP2'!DP15)","v":0},{"$f":"IF(A22=\"\",\"\",'STP2'!DQ15)","v":0},0,{"$f":"IF(A22=\"\",\"\",'STP2'!DR15)","v":0},{"$f":"IF(A22=\"\",\"\",'STP2'!DS15)","v":0},{"$f":"IF(A22=\"\",\"\",'STP2'!DT15)","v":0},{"$f":"IF(A22=\"\",\"\",'STP2'!DU15)","v":0},{"$f":"IF(A22=\"\",\"\",'STP2'!DV15)","v":0},{"$f":"IF(A22=\"\",\"\",'STP2'!DW15)","v":0},{"$f":"IF(A22=\"\",\"\",'STP2'!DX15)","v":0},{"$f":"IF(A22=\"\",\"\",'STP2'!DY15)","v":0},{"$f":"IF(A22=\"\",\"\",'STP2'!DZ15)","v":0},{"$f":"IF(A22=\"\",\"\",'STP2'!EA15)","v":0},0,{"$f":"IF(A22=\"\",\"\",'STP2'!EB15)","v":0},{"$f":"IF(A22=\"\",\"\",'STP2'!EC15)","v":0},{"$f":"IF(A22=\"\",\"\",'STP2'!ED15)","v":0},{"$f":"IF(A22=\"\",\"\",'STP2'!EE15)","v":0},{"$f":"IF(A22=\"\",\"\",'STP2'!EF15)","v":0},{"$f":"IF(A22=\"\",\"\",'STP2'!EG15)","v":0},{"$f":"IF(A22=\"\",\"\",'STP2'!EH15)","v":0},{"$f":"IF(A22=\"\",\"\",'STP2'!EI15)","v":0},{"$f":"IF(A22=\"\",\"\",'STP2'!EJ15)","v":0},{"$f":"IF(A22=\"\",\"\",'STP2'!EK15)","v":0},0,{"$f":"IF(A18=\"\",\"\",'STP2'!AV15)","v":6},{"$f":"IF(A18=\"\",\"\",'STP2'!AW15)","v":0},{"$f":"IF(A18=\"\",\"\",'STP2'!AX15)","v":0}]
[{"$f":"IF('STP2'!I16=\"99\",\"\",'STP2'!I16)","v":""},{"$f":"IF(A23=\"\",\"\",'STP2'!J16)","v":""},"",{"$f":"IF(A23=\"\",\"\",IF('STP2'!K16,\"ASO\",IF('STP2'!L16,\"SE\",IF('STP2'!M16,\"KB\",IF('STP2'!N16,\"SB\",IF('STP2'!O16,\"SI\",IF('STP2'!P16,\"MB\",\"S\")))))))","v":""},{"$f":"IF(A23=\"\",\"\",'STP2'!S16)","v":""},{"$f":"IF(A23=\"\",\"\",'STP2'!V16)","v":""},{"$f":"IF(A23=\"\",\"\",'STP2'!Y16)","v":""},{"$f":"IF(A23=\"\",\"\",'STP2'!AB16)","v":""},{"$f":"IF(A23=\"\",\"\",'STP2'!AE16)","v":""},"",{"$f":"IF(A23=\"\",\"\", J23-'STP2'!T16-'STP2'!W16-'STP2'!Z16-'STP2'!AC16-'STP2'!AF16)","v":""},{"$f":"IF(A23=\"\",\"\",'STP2'!AH16)","v":""},{"$f":"IF(A23=\"\",\"\",'STP2'!AK16)","v":""},{"$f":"IF(A23=\"\",\"\",'STP2'!AN16)","v":""},{"$f":"IF(A23=\"\",\"\",'STP2'!AQ16)","v":""},"",{"$f":"IF(A23=\"\",\"\",P23-'STP2'!AI16-'STP2'!AL16-'STP2'!AO16-'STP2'!AR16)","v":""},{"$f":"IF(A23=\"\",\"\",'STP2'!AT16)","v":""},{"$f":"IF(A23=\"\",\"\",R23-'STP2'!AU16)","v":""},"",{"$f":"IF(A23=\"\",\"\",'STP2'!CD16)","v":""},{"$f":"IF(A23=\"\",\"\",'STP2'!CE16)","v":""},{"$f":"IF(A23=\"\",\"\",'STP2'!CF16)","v":""},{"$f":"IF(A23=\"\",\"\",'STP2'!CG16)","v":""},{"$f":"IF(A23=\"\",\"\",'STP2'!CH16)","v":""},{"$f":"IF(A23=\"\",\"\",'STP2'!CI16)","v":""},{"$f":"IF(A23=\"\",\"\",'STP2'!CJ16)","v":""},{"$f":"IF(A23=\"\",\"\",'STP2'!CK16)","v":""},{"$f":"IF(A23=\"\",\"\",'STP2'!CL16)","v":""},{"$f":"IF(A23=\"\",\"\",'STP2'!CM16)","v":""},"",{"$f":"IF(A23=\"\",\"\",'STP2'!CN16)","v":""},{"$f":"IF(A23=\"\",\"\",'STP2'!CO16)","v":""},{"$f":"IF(A23=\"\",\"\",'STP2'!CP16)","v":""},{"$f":"IF(A23=\"\",\"\",'STP2'!CQ16)","v":""},{"$f":"IF(A23=\"\",\"\",'STP2'!CR16)","v":""},{"$f":"IF(A23=\"\",\"\",'STP2'!CS16)","v":""},{"$f":"IF(A23=\"\",\"\",'STP2'!CT16)","v":""},{"$f":"IF(A23=\"\",\"\",'STP2'!CU16)","v":""},{"$f":"IF(A23=\"\",\"\",'STP2'!CV16)","v":""},{"$f":"IF(A23=\"\",\"\",'STP2'!CW16)","v":""},"",{"$f":"IF(A23=\"\",\"\",'STP2'!CX16)","v":""},{"$f":"IF(A23=\"\",\"\",'STP2'!CY16)","v":""},{"$f":"IF(A23=\"\",\"\",'STP2'!CZ16)","v":""},{"$f":"IF(A23=\"\",\"\",'STP2'!DA16)","v":""},{"$f":"IF(A23=\"\",\"\",'STP2'!DB16)","v":""},{"$f":"IF(A23=\"\",\"\",'STP2'!DC16)","v":""},{"$f":"IF(A23=\"\",\"\",'STP2'!DD16)","v":""},{"$f":"IF(A23=\"\",\"\",'STP2'!DE16)","v":""},{"$f":"IF(A23=\"\",\"\",'STP2'!DF16)","v":""},{"$f":"IF(A23=\"\",\"\",'STP2'!DG16)","v":""},"",{"$f":"IF(A23=\"\",\"\",'STP2'!DH16)","v":""},{"$f":"IF(A23=\"\",\"\",'STP2'!DI16)","v":""},{"$f":"IF(A23=\"\",\"\",'STP2'!DJ16)","v":""},{"$f":"IF(A23=\"\",\"\",'STP2'!DK16)","v":""},{"$f":"IF(A23=\"\",\"\",'STP2'!DL16)","v":""},{"$f":"IF(A23=\"\",\"\",'STP2'!DM16)","v":""},{"$f":"IF(A23=\"\",\"\",'STP2'!DN16)","v":""},{"$f":"IF(A23=\"\",\"\",'STP2'!DO16)","v":""},{"$f":"IF(A23=\"\",\"\",'STP2'!DP16)","v":""},{"$f":"IF(A23=\"\",\"\",'STP2'!DQ16)","v":""},"",{"$f":"IF(A23=\"\",\"\",'STP2'!DR16)","v":""},{"$f":"IF(A23=\"\",\"\",'STP2'!DS16)","v":""},{"$f":"IF(A23=\"\",\"\",'STP2'!DT16)","v":""},{"$f":"IF(A23=\"\",\"\",'STP2'!DU16)","v":""},{"$f":"IF(A23=\"\",\"\",'STP2'!DV16)","v":""},{"$f":"IF(A23=\"\",\"\",'STP2'!DW16)","v":""},{"$f":"IF(A23=\"\",\"\",'STP2'!DX16)","v":""},{"$f":"IF(A23=\"\",\"\",'STP2'!DY16)","v":""},{"$f":"IF(A23=\"\",\"\",'STP2'!DZ16)","v":""},{"$f":"IF(A23=\"\",\"\",'STP2'!EA16)","v":""},"",{"$f":"IF(A23=\"\",\"\",'STP2'!EB16)","v":""},{"$f":"IF(A23=\"\",\"\",'STP2'!EC16)","v":""},{"$f":"IF(A23=\"\",\"\",'STP2'!ED16)","v":""},{"$f":"IF(A23=\"\",\"\",'STP2'!EE16)","v":""},{"$f":"IF(A23=\"\",\"\",'STP2'!EF16)","v":""},{"$f":"IF(A23=\"\",\"\",'STP2'!EG16)","v":""},{"$f":"IF(A23=\"\",\"\",'STP2'!EH16)","v":""},{"$f":"IF(A23=\"\",\"\",'STP2'!EI16)","v":""},{"$f":"IF(A23=\"\",\"\",'STP2'!EJ16)","v":""},{"$f":"IF(A23=\"\",\"\",'STP2'!EK16)","v":""},"",{"$f":"IF(A19=\"\",\"\",'STP2'!AV16)","v":""},{"$f":"IF(A19=\"\",\"\",'STP2'!AW16)","v":""},{"$f":"IF(A19=\"\",\"\",'STP2'!AX16)","v":""}]
[{"$f":"IF('STP2'!I17=\"99\",\"\",'STP2'!I17)","v":""},{"$f":"IF(A24=\"\",\"\",'STP2'!J17)","v":""},"",{"$f":"IF(A24=\"\",\"\",IF('STP2'!K17,\"ASO\",IF('STP2'!L17,\"SE\",IF('STP2'!M17,\"KB\",IF('STP2'!N17,\"SB\",IF('STP2'!O17,\"SI\",IF('STP2'!P17,\"MB\",\"S\")))))))","v":""},{"$f":"IF(A24=\"\",\"\",'STP2'!S17)","v":""},{"$f":"IF(A24=\"\",\"\",'STP2'!V17)","v":""},{"$f":"IF(A24=\"\",\"\",'STP2'!Y17)","v":""},{"$f":"IF(A24=\"\",\"\",'STP2'!AB17)","v":""},{"$f":"IF(A24=\"\",\"\",'STP2'!AE17)","v":""},"",{"$f":"IF(A24=\"\",\"\", J24-'STP2'!T17-'STP2'!W17-'STP2'!Z17-'STP2'!AC17-'STP2'!AF17)","v":""},{"$f":"IF(A24=\"\",\"\",'STP2'!AH17)","v":""},{"$f":"IF(A24=\"\",\"\",'STP2'!AK17)","v":""},{"$f":"IF(A24=\"\",\"\",'STP2'!AN17)","v":""},{"$f":"IF(A24=\"\",\"\",'STP2'!AQ17)","v":""},"",{"$f":"IF(A24=\"\",\"\",P24-'STP2'!AI17-'STP2'!AL17-'STP2'!AO17-'STP2'!AR17)","v":""},{"$f":"IF(A24=\"\",\"\",'STP2'!AT17)","v":""},{"$f":"IF(A24=\"\",\"\",R24-'STP2'!AU17)","v":""},"",{"$f":"IF(A24=\"\",\"\",'STP2'!CD17)","v":""},{"$f":"IF(A24=\"\",\"\",'STP2'!CE17)","v":""},{"$f":"IF(A24=\"\",\"\",'STP2'!CF17)","v":""},{"$f":"IF(A24=\"\",\"\",'STP2'!CG17)","v":""},{"$f":"IF(A24=\"\",\"\",'STP2'!CH17)","v":""},{"$f":"IF(A24=\"\",\"\",'STP2'!CI17)","v":""},{"$f":"IF(A24=\"\",\"\",'STP2'!CJ17)","v":""},{"$f":"IF(A24=\"\",\"\",'STP2'!CK17)","v":""},{"$f":"IF(A24=\"\",\"\",'STP2'!CL17)","v":""},{"$f":"IF(A24=\"\",\"\",'STP2'!CM17)","v":""},"",{"$f":"IF(A24=\"\",\"\",'STP2'!CN17)","v":""},{"$f":"IF(A24=\"\",\"\",'STP2'!CO17)","v":""},{"$f":"IF(A24=\"\",\"\",'STP2'!CP17)","v":""},{"$f":"IF(A24=\"\",\"\",'STP2'!CQ17)","v":""},{"$f":"IF(A24=\"\",\"\",'STP2'!CR17)","v":""},{"$f":"IF(A24=\"\",\"\",'STP2'!CS17)","v":""},{"$f":"IF(A24=\"\",\"\",'STP2'!CT17)","v":""},{"$f":"IF(A24=\"\",\"\",'STP2'!CU17)","v":""},{"$f":"IF(A24=\"\",\"\",'STP2'!CV17)","v":""},{"$f":"IF(A24=\"\",\"\",'STP2'!CW17)","v":""},"",{"$f":"IF(A24=\"\",\"\",'STP2'!CX17)","v":""},{"$f":"IF(A24=\"\",\"\",'STP2'!CY17)","v":""},{"$f":"IF(A24=\"\",\"\",'STP2'!CZ17)","v":""},{"$f":"IF(A24=\"\",\"\",'STP2'!DA17)","v":""},{"$f":"IF(A24=\"\",\"\",'STP2'!DB17)","v":""},{"$f":"IF(A24=\"\",\"\",'STP2'!DC17)","v":""},{"$f":"IF(A24=\"\",\"\",'STP2'!DD17)","v":""},{"$f":"IF(A24=\"\",\"\",'STP2'!DE17)","v":""},{"$f":"IF(A24=\"\",\"\",'STP2'!DF17)","v":""},{"$f":"IF(A24=\"\",\"\",'STP2'!DG17)","v":""},"",{"$f":"IF(A24=\"\",\"\",'STP2'!DH17)","v":""},{"$f":"IF(A24=\"\",\"\",'STP2'!DI17)","v":""},{"$f":"IF(A24=\"\",\"\",'STP2'!DJ17)","v":""},{"$f":"IF(A24=\"\",\"\",'STP2'!DK17)","v":""},{"$f":"IF(A24=\"\",\"\",'STP2'!DL17)","v":""},{"$f":"IF(A24=\"\",\"\",'STP2'!DM17)","v":""},{"$f":"IF(A24=\"\",\"\",'STP2'!DN17)","v":""},{"$f":"IF(A24=\"\",\"\",'STP2'!DO17)","v":""},{"$f":"IF(A24=\"\",\"\",'STP2'!DP17)","v":""},{"$f":"IF(A24=\"\",\"\",'STP2'!DQ17)","v":""},"",{"$f":"IF(A24=\"\",\"\",'STP2'!DR17)","v":""},{"$f":"IF(A24=\"\",\"\",'STP2'!DS17)","v":""},{"$f":"IF(A24=\"\",\"\",'STP2'!DT17)","v":""},{"$f":"IF(A24=\"\",\"\",'STP2'!DU17)","v":""},{"$f":"IF(A24=\"\",\"\",'STP2'!DV17)","v":""},{"$f":"IF(A24=\"\",\"\",'STP2'!DW17)","v":""},{"$f":"IF(A24=\"\",\"\",'STP2'!DX17)","v":""},{"$f":"IF(A24=\"\",\"\",'STP2'!DY17)","v":""},{"$f":"IF(A24=\"\",\"\",'STP2'!DZ17)","v":""},{"$f":"IF(A24=\"\",\"\",'STP2'!EA17)","v":""},"",{"$f":"IF(A24=\"\",\"\",'STP2'!EB17)","v":""},{"$f":"IF(A24=\"\",\"\",'STP2'!EC17)","v":""},{"$f":"IF(A24=\"\",\"\",'STP2'!ED17)","v":""},{"$f":"IF(A24=\"\",\"\",'STP2'!EE17)","v":""},{"$f":"IF(A24=\"\",\"\",'STP2'!EF17)","v":""},{"$f":"IF(A24=\"\",\"\",'STP2'!EG17)","v":""},{"$f":"IF(A24=\"\",\"\",'STP2'!EH17)","v":""},{"$f":"IF(A24=\"\",\"\",'STP2'!EI17)","v":""},{"$f":"IF(A24=\"\",\"\",'STP2'!EJ17)","v":""},{"$f":"IF(A24=\"\",\"\",'STP2'!EK17)","v":""},"",{"$f":"IF(A20=\"\",\"\",'STP2'!AV17)","v":""},{"$f":"IF(A20=\"\",\"\",'STP2'!AW17)","v":""},{"$f":"IF(A20=\"\",\"\",'STP2'!AX17)","v":""}]
[{"$f":"IF('STP2'!I18=\"99\",\"\",'STP2'!I18)","v":""},{"$f":"IF(A25=\"\",\"\",'STP2'!J18)","v":""},"",{"$f":"IF(A25=\"\",\"\",IF('STP2'!K18,\"ASO\",IF('STP2'!L18,\"SE\",IF('STP2'!M18,\"KB\",IF('STP2'!N18,\"SB\",IF('STP2'!O18,\"SI\",IF('STP2'!P18,\"MB\",\"S\")))))))","v":""},{"$f":"IF(A25=\"\",\"\",'STP2'!S18)","v":""},{"$f":"IF(A25=\"\",\"\",'STP2'!V18)","v":""},{"$f":"IF(A25=\"\",\"\",'STP2'!Y18)","v":""},{"$f":"IF(A25=\"\",\"\",'STP2'!AB18)","v":""},{"$f":"IF(A25=\"\",\"\",'STP2'!AE18)","v":""},"",{"$f":"IF(A25=\"\",\"\", J25-'STP2'!T18-'STP2'!W18-'STP2'!Z18-'STP2'!AC18-'STP2'!AF18)","v":""},{"$f":"IF(A25=\"\",\"\",'STP2'!AH18)","v":""},{"$f":"IF(A25=\"\",\"\",'STP2'!AK18)","v":""},{"$f":"IF(A25=\"\",\"\",'STP2'!AN18)","v":""},{"$f":"IF(A25=\"\",\"\",'STP2'!AQ18)","v":""},"",{"$f":"IF(A25=\"\",\"\",P25-'STP2'!AI18-'STP2'!AL18-'STP2'!AO18-'STP2'!AR18)","v":""},{"$f":"IF(A25=\"\",\"\",'STP2'!AT18)","v":""},{"$f":"IF(A25=\"\",\"\",R25-'STP2'!AU18)","v":""},"",{"$f":"IF(A25=\"\",\"\",'STP2'!CD18)","v":""},{"$f":"IF(A25=\"\",\"\",'STP2'!CE18)","v":""},{"$f":"IF(A25=\"\",\"\",'STP2'!CF18)","v":""},{"$f":"IF(A25=\"\",\"\",'STP2'!CG18)","v":""},{"$f":"IF(A25=\"\",\"\",'STP2'!CH18)","v":""},{"$f":"IF(A25=\"\",\"\",'STP2'!CI18)","v":""},{"$f":"IF(A25=\"\",\"\",'STP2'!CJ18)","v":""},{"$f":"IF(A25=\"\",\"\",'STP2'!CK18)","v":""},{"$f":"IF(A25=\"\",\"\",'STP2'!CL18)","v":""},{"$f":"IF(A25=\"\",\"\",'STP2'!CM18)","v":""},"",{"$f":"IF(A25=\"\",\"\",'STP2'!CN18)","v":""},{"$f":"IF(A25=\"\",\"\",'STP2'!CO18)","v":""},{"$f":"IF(A25=\"\",\"\",'STP2'!CP18)","v":""},{"$f":"IF(A25=\"\",\"\",'STP2'!CQ18)","v":""},{"$f":"IF(A25=\"\",\"\",'STP2'!CR18)","v":""},{"$f":"IF(A25=\"\",\"\",'STP2'!CS18)","v":""},{"$f":"IF(A25=\"\",\"\",'STP2'!CT18)","v":""},{"$f":"IF(A25=\"\",\"\",'STP2'!CU18)","v":""},{"$f":"IF(A25=\"\",\"\",'STP2'!CV18)","v":""},{"$f":"IF(A25=\"\",\"\",'STP2'!CW18)","v":""},"",{"$f":"IF(A25=\"\",\"\",'STP2'!CX18)","v":""},{"$f":"IF(A25=\"\",\"\",'STP2'!CY18)","v":""},{"$f":"IF(A25=\"\",\"\",'STP2'!CZ18)","v":""},{"$f":"IF(A25=\"\",\"\",'STP2'!DA18)","v":""},{"$f":"IF(A25=\"\",\"\",'STP2'!DB18)","v":""},{"$f":"IF(A25=\"\",\"\",'STP2'!DC18)","v":""},{"$f":"IF(A25=\"\",\"\",'STP2'!DD18)","v":""},{"$f":"IF(A25=\"\",\"\",'STP2'!DE18)","v":""},{"$f":"IF(A25=\"\",\"\",'STP2'!DF18)","v":""},{"$f":"IF(A25=\"\",\"\",'STP2'!DG18)","v":""},"",{"$f":"IF(A25=\"\",\"\",'STP2'!DH18)","v":""},{"$f":"IF(A25=\"\",\"\",'STP2'!DI18)","v":""},{"$f":"IF(A25=\"\",\"\",'STP2'!DJ18)","v":""},{"$f":"IF(A25=\"\",\"\",'STP2'!DK18)","v":""},{"$f":"IF(A25=\"\",\"\",'STP2'!DL18)","v":""},{"$f":"IF(A25=\"\",\"\",'STP2'!DM18)","v":""},{"$f":"IF(A25=\"\",\"\",'STP2'!DN18)","v":""},{"$f":"IF(A25=\"\",\"\",'STP2'!DO18)","v":""},{"$f":"IF(A25=\"\",\"\",'STP2'!DP18)","v":""},{"$f":"IF(A25=\"\",\"\",'STP2'!DQ18)","v":""},"",{"$f":"IF(A25=\"\",\"\",'STP2'!DR18)","v":""},{"$f":"IF(A25=\"\",\"\",'STP2'!DS18)","v":""},{"$f":"IF(A25=\"\",\"\",'STP2'!DT18)","v":""},{"$f":"IF(A25=\"\",\"\",'STP2'!DU18)","v":""},{"$f":"IF(A25=\"\",\"\",'STP2'!DV18)","v":""},{"$f":"IF(A25=\"\",\"\",'STP2'!DW18)","v":""},{"$f":"IF(A25=\"\",\"\",'STP2'!DX18)","v":""},{"$f":"IF(A25=\"\",\"\",'STP2'!DY18)","v":""},{"$f":"IF(A25=\"\",\"\",'STP2'!DZ18)","v":""},{"$f":"IF(A25=\"\",\"\",'STP2'!EA18)","v":""},"",{"$f":"IF(A25=\"\",\"\",'STP2'!EB18)","v":""},{"$f":"IF(A25=\"\",\"\",'STP2'!EC18)","v":""},{"$f":"IF(A25=\"\",\"\",'STP2'!ED18)","v":""},{"$f":"IF(A25=\"\",\"\",'STP2'!EE18)","v":""},{"$f":"IF(A25=\"\",\"\",'STP2'!EF18)","v":""},{"$f":"IF(A25=\"\",\"\",'STP2'!EG18)","v":""},{"$f":"IF(A25=\"\",\"\",'STP2'!EH18)","v":""},{"$f":"IF(A25=\"\",\"\",'STP2'!EI18)","v":""},{"$f":"IF(A25=\"\",\"\",'STP2'!EJ18)","v":""},{"$f":"IF(A25=\"\",\"\",'STP2'!EK18)","v":""},"",{"$f":"IF(A21=\"\",\"\",'STP2'!AV18)","v":""},{"$f":"IF(A21=\"\",\"\",'STP2'!AW18)","v":""},{"$f":"IF(A21=\"\",\"\",'STP2'!AX18)","v":""}]
[{"$f":"IF('STP2'!I19=\"99\",\"\",'STP2'!I19)","v":""},{"$f":"IF(A26=\"\",\"\",'STP2'!J19)","v":""},"",{"$f":"IF(A26=\"\",\"\",IF('STP2'!K19,\"ASO\",IF('STP2'!L19,\"SE\",IF('STP2'!M19,\"KB\",IF('STP2'!N19,\"SB\",IF('STP2'!O19,\"SI\",IF('STP2'!P19,\"MB\",\"S\")))))))","v":""},{"$f":"IF(A26=\"\",\"\",'STP2'!S19)","v":""},{"$f":"IF(A26=\"\",\"\",'STP2'!V19)","v":""},{"$f":"IF(A26=\"\",\"\",'STP2'!Y19)","v":""},{"$f":"IF(A26=\"\",\"\",'STP2'!AB19)","v":""},{"$f":"IF(A26=\"\",\"\",'STP2'!AE19)","v":""},"",{"$f":"IF(A26=\"\",\"\", J26-'STP2'!T19-'STP2'!W19-'STP2'!Z19-'STP2'!AC19-'STP2'!AF19)","v":""},{"$f":"IF(A26=\"\",\"\",'STP2'!AH19)","v":""},{"$f":"IF(A26=\"\",\"\",'STP2'!AK19)","v":""},{"$f":"IF(A26=\"\",\"\",'STP2'!AN19)","v":""},{"$f":"IF(A26=\"\",\"\",'STP2'!AQ19)","v":""},"",{"$f":"IF(A26=\"\",\"\",P26-'STP2'!AI19-'STP2'!AL19-'STP2'!AO19-'STP2'!AR19)","v":""},{"$f":"IF(A26=\"\",\"\",'STP2'!AT19)","v":""},{"$f":"IF(A26=\"\",\"\",R26-'STP2'!AU19)","v":""},"",{"$f":"IF(A26=\"\",\"\",'STP2'!CD19)","v":""},{"$f":"IF(A26=\"\",\"\",'STP2'!CE19)","v":""},{"$f":"IF(A26=\"\",\"\",'STP2'!CF19)","v":""},{"$f":"IF(A26=\"\",\"\",'STP2'!CG19)","v":""},{"$f":"IF(A26=\"\",\"\",'STP2'!CH19)","v":""},{"$f":"IF(A26=\"\",\"\",'STP2'!CI19)","v":""},{"$f":"IF(A26=\"\",\"\",'STP2'!CJ19)","v":""},{"$f":"IF(A26=\"\",\"\",'STP2'!CK19)","v":""},{"$f":"IF(A26=\"\",\"\",'STP2'!CL19)","v":""},{"$f":"IF(A26=\"\",\"\",'STP2'!CM19)","v":""},"",{"$f":"IF(A26=\"\",\"\",'STP2'!CN19)","v":""},{"$f":"IF(A26=\"\",\"\",'STP2'!CO19)","v":""},{"$f":"IF(A26=\"\",\"\",'STP2'!CP19)","v":""},{"$f":"IF(A26=\"\",\"\",'STP2'!CQ19)","v":""},{"$f":"IF(A26=\"\",\"\",'STP2'!CR19)","v":""},{"$f":"IF(A26=\"\",\"\",'STP2'!CS19)","v":""},{"$f":"IF(A26=\"\",\"\",'STP2'!CT19)","v":""},{"$f":"IF(A26=\"\",\"\",'STP2'!CU19)","v":""},{"$f":"IF(A26=\"\",\"\",'STP2'!CV19)","v":""},{"$f":"IF(A26=\"\",\"\",'STP2'!CW19)","v":""},"",{"$f":"IF(A26=\"\",\"\",'STP2'!CX19)","v":""},{"$f":"IF(A26=\"\",\"\",'STP2'!CY19)","v":""},{"$f":"IF(A26=\"\",\"\",'STP2'!CZ19)","v":""},{"$f":"IF(A26=\"\",\"\",'STP2'!DA19)","v":""},{"$f":"IF(A26=\"\",\"\",'STP2'!DB19)","v":""},{"$f":"IF(A26=\"\",\"\",'STP2'!DC19)","v":""},{"$f":"IF(A26=\"\",\"\",'STP2'!DD19)","v":""},{"$f":"IF(A26=\"\",\"\",'STP2'!DE19)","v":""},{"$f":"IF(A26=\"\",\"\",'STP2'!DF19)","v":""},{"$f":"IF(A26=\"\",\"\",'STP2'!DG19)","v":""},"",{"$f":"IF(A26=\"\",\"\",'STP2'!DH19)","v":""},{"$f":"IF(A26=\"\",\"\",'STP2'!DI19)","v":""},{"$f":"IF(A26=\"\",\"\",'STP2'!DJ19)","v":""},{"$f":"IF(A26=\"\",\"\",'STP2'!DK19)","v":""},{"$f":"IF(A26=\"\",\"\",'STP2'!DL19)","v":""},{"$f":"IF(A26=\"\",\"\",'STP2'!DM19)","v":""},{"$f":"IF(A26=\"\",\"\",'STP2'!DN19)","v":""},{"$f":"IF(A26=\"\",\"\",'STP2'!DO19)","v":""},{"$f":"IF(A26=\"\",\"\",'STP2'!DP19)","v":""},{"$f":"IF(A26=\"\",\"\",'STP2'!DQ19)","v":""},"",{"$f":"IF(A26=\"\",\"\",'STP2'!DR19)","v":""},{"$f":"IF(A26=\"\",\"\",'STP2'!DS19)","v":""},{"$f":"IF(A26=\"\",\"\",'STP2'!DT19)","v":""},{"$f":"IF(A26=\"\",\"\",'STP2'!DU19)","v":""},{"$f":"IF(A26=\"\",\"\",'STP2'!DV19)","v":""},{"$f":"IF(A26=\"\",\"\",'STP2'!DW19)","v":""},{"$f":"IF(A26=\"\",\"\",'STP2'!DX19)","v":""},{"$f":"IF(A26=\"\",\"\",'STP2'!DY19)","v":""},{"$f":"IF(A26=\"\",\"\",'STP2'!DZ19)","v":""},{"$f":"IF(A26=\"\",\"\",'STP2'!EA19)","v":""},"",{"$f":"IF(A26=\"\",\"\",'STP2'!EB19)","v":""},{"$f":"IF(A26=\"\",\"\",'STP2'!EC19)","v":""},{"$f":"IF(A26=\"\",\"\",'STP2'!ED19)","v":""},{"$f":"IF(A26=\"\",\"\",'STP2'!EE19)","v":""},{"$f":"IF(A26=\"\",\"\",'STP2'!EF19)","v":""},{"$f":"IF(A26=\"\",\"\",'STP2'!EG19)","v":""},{"$f":"IF(A26=\"\",\"\",'STP2'!EH19)","v":""},{"$f":"IF(A26=\"\",\"\",'STP2'!EI19)","v":""},{"$f":"IF(A26=\"\",\"\",'STP2'!EJ19)","v":""},{"$f":"IF(A26=\"\",\"\",'STP2'!EK19)","v":""},"",{"$f":"IF(A22=\"\",\"\",'STP2'!AV19)","v":""},{"$f":"IF(A22=\"\",\"\",'STP2'!AW19)","v":""},{"$f":"IF(A22=\"\",\"\",'STP2'!AX19)","v":""}]
[{"$f":"IF('STP2'!I20=\"99\",\"\",'STP2'!I20)","v":""},{"$f":"IF(A27=\"\",\"\",'STP2'!J20)","v":""},"",{"$f":"IF(A27=\"\",\"\",IF('STP2'!K20,\"ASO\",IF('STP2'!L20,\"SE\",IF('STP2'!M20,\"KB\",IF('STP2'!N20,\"SB\",IF('STP2'!O20,\"SI\",IF('STP2'!P20,\"MB\",\"S\")))))))","v":""},{"$f":"IF(A27=\"\",\"\",'STP2'!S20)","v":""},{"$f":"IF(A27=\"\",\"\",'STP2'!V20)","v":""},{"$f":"IF(A27=\"\",\"\",'STP2'!Y20)","v":""},{"$f":"IF(A27=\"\",\"\",'STP2'!AB20)","v":""},{"$f":"IF(A27=\"\",\"\",'STP2'!AE20)","v":""},"",{"$f":"IF(A27=\"\",\"\", J27-'STP2'!T20-'STP2'!W20-'STP2'!Z20-'STP2'!AC20-'STP2'!AF20)","v":""},{"$f":"IF(A27=\"\",\"\",'STP2'!AH20)","v":""},{"$f":"IF(A27=\"\",\"\",'STP2'!AK20)","v":""},{"$f":"IF(A27=\"\",\"\",'STP2'!AN20)","v":""},{"$f":"IF(A27=\"\",\"\",'STP2'!AQ20)","v":""},"",{"$f":"IF(A27=\"\",\"\",P27-'STP2'!AI20-'STP2'!AL20-'STP2'!AO20-'STP2'!AR20)","v":""},{"$f":"IF(A27=\"\",\"\",'STP2'!AT20)","v":""},{"$f":"IF(A27=\"\",\"\",R27-'STP2'!AU20)","v":""},"",{"$f":"IF(A27=\"\",\"\",'STP2'!CD20)","v":""},{"$f":"IF(A27=\"\",\"\",'STP2'!CE20)","v":""},{"$f":"IF(A27=\"\",\"\",'STP2'!CF20)","v":""},{"$f":"IF(A27=\"\",\"\",'STP2'!CG20)","v":""},{"$f":"IF(A27=\"\",\"\",'STP2'!CH20)","v":""},{"$f":"IF(A27=\"\",\"\",'STP2'!CI20)","v":""},{"$f":"IF(A27=\"\",\"\",'STP2'!CJ20)","v":""},{"$f":"IF(A27=\"\",\"\",'STP2'!CK20)","v":""},{"$f":"IF(A27=\"\",\"\",'STP2'!CL20)","v":""},{"$f":"IF(A27=\"\",\"\",'STP2'!CM20)","v":""},"",{"$f":"IF(A27=\"\",\"\",'STP2'!CN20)","v":""},{"$f":"IF(A27=\"\",\"\",'STP2'!CO20)","v":""},{"$f":"IF(A27=\"\",\"\",'STP2'!CP20)","v":""},{"$f":"IF(A27=\"\",\"\",'STP2'!CQ20)","v":""},{"$f":"IF(A27=\"\",\"\",'STP2'!CR20)","v":""},{"$f":"IF(A27=\"\",\"\",'STP2'!CS20)","v":""},{"$f":"IF(A27=\"\",\"\",'STP2'!CT20)","v":""},{"$f":"IF(A27=\"\",\"\",'STP2'!CU20)","v":""},{"$f":"IF(A27=\"\",\"\",'STP2'!CV20)","v":""},{"$f":"IF(A27=\"\",\"\",'STP2'!CW20)","v":""},"",{"$f":"IF(A27=\"\",\"\",'STP2'!CX20)","v":""},{"$f":"IF(A27=\"\",\"\",'STP2'!CY20)","v":""},{"$f":"IF(A27=\"\",\"\",'STP2'!CZ20)","v":""},{"$f":"IF(A27=\"\",\"\",'STP2'!DA20)","v":""},{"$f":"IF(A27=\"\",\"\",'STP2'!DB20)","v":""},{"$f":"IF(A27=\"\",\"\",'STP2'!DC20)","v":""},{"$f":"IF(A27=\"\",\"\",'STP2'!DD20)","v":""},{"$f":"IF(A27=\"\",\"\",'STP2'!DE20)","v":""},{"$f":"IF(A27=\"\",\"\",'STP2'!DF20)","v":""},{"$f":"IF(A27=\"\",\"\",'STP2'!DG20)","v":""},"",{"$f":"IF(A27=\"\",\"\",'STP2'!DH20)","v":""},{"$f":"IF(A27=\"\",\"\",'STP2'!DI20)","v":""},{"$f":"IF(A27=\"\",\"\",'STP2'!DJ20)","v":""},{"$f":"IF(A27=\"\",\"\",'STP2'!DK20)","v":""},{"$f":"IF(A27=\"\",\"\",'STP2'!DL20)","v":""},{"$f":"IF(A27=\"\",\"\",'STP2'!DM20)","v":""},{"$f":"IF(A27=\"\",\"\",'STP2'!DN20)","v":""},{"$f":"IF(A27=\"\",\"\",'STP2'!DO20)","v":""},{"$f":"IF(A27=\"\",\"\",'STP2'!DP20)","v":""},{"$f":"IF(A27=\"\",\"\",'STP2'!DQ20)","v":""},"",{"$f":"IF(A27=\"\",\"\",'STP2'!DR20)","v":""},{"$f":"IF(A27=\"\",\"\",'STP2'!DS20)","v":""},{"$f":"IF(A27=\"\",\"\",'STP2'!DT20)","v":""},{"$f":"IF(A27=\"\",\"\",'STP2'!DU20)","v":""},{"$f":"IF(A27=\"\",\"\",'STP2'!DV20)","v":""},{"$f":"IF(A27=\"\",\"\",'STP2'!DW20)","v":""},{"$f":"IF(A27=\"\",\"\",'STP2'!DX20)","v":""},{"$f":"IF(A27=\"\",\"\",'STP2'!DY20)","v":""},{"$f":"IF(A27=\"\",\"\",'STP2'!DZ20)","v":""},{"$f":"IF(A27=\"\",\"\",'STP2'!EA20)","v":""},"",{"$f":"IF(A27=\"\",\"\",'STP2'!EB20)","v":""},{"$f":"IF(A27=\"\",\"\",'STP2'!EC20)","v":""},{"$f":"IF(A27=\"\",\"\",'STP2'!ED20)","v":""},{"$f":"IF(A27=\"\",\"\",'STP2'!EE20)","v":""},{"$f":"IF(A27=\"\",\"\",'STP2'!EF20)","v":""},{"$f":"IF(A27=\"\",\"\",'STP2'!EG20)","v":""},{"$f":"IF(A27=\"\",\"\",'STP2'!EH20)","v":""},{"$f":"IF(A27=\"\",\"\",'STP2'!EI20)","v":""},{"$f":"IF(A27=\"\",\"\",'STP2'!EJ20)","v":""},{"$f":"IF(A27=\"\",\"\",'STP2'!EK20)","v":""},"",{"$f":"IF(A23=\"\",\"\",'STP2'!AV20)","v":""},{"$f":"IF(A23=\"\",\"\",'STP2'!AW20)","v":""},{"$f":"IF(A23=\"\",\"\",'STP2'!AX20)","v":""}]
[{"$f":"IF('STP2'!I21=\"99\",\"\",'STP2'!I21)","v":""},{"$f":"IF(A28=\"\",\"\",'STP2'!J21)","v":""},"",{"$f":"IF(A28=\"\",\"\",IF('STP2'!K21,\"ASO\",IF('STP2'!L21,\"SE\",IF('STP2'!M21,\"KB\",IF('STP2'!N21,\"SB\",IF('STP2'!O21,\"SI\",IF('STP2'!P21,\"MB\",\"S\")))))))","v":""},{"$f":"IF(A28=\"\",\"\",'STP2'!S21)","v":""},{"$f":"IF(A28=\"\",\"\",'STP2'!V21)","v":""},{"$f":"IF(A28=\"\",\"\",'STP2'!Y21)","v":""},{"$f":"IF(A28=\"\",\"\",'STP2'!AB21)","v":""},{"$f":"IF(A28=\"\",\"\",'STP2'!AE21)","v":""},"",{"$f":"IF(A28=\"\",\"\", J28-'STP2'!T21-'STP2'!W21-'STP2'!Z21-'STP2'!AC21-'STP2'!AF21)","v":""},{"$f":"IF(A28=\"\",\"\",'STP2'!AH21)","v":""},{"$f":"IF(A28=\"\",\"\",'STP2'!AK21)","v":""},{"$f":"IF(A28=\"\",\"\",'STP2'!AN21)","v":""},{"$f":"IF(A28=\"\",\"\",'STP2'!AQ21)","v":""},"",{"$f":"IF(A28=\"\",\"\",P28-'STP2'!AI21-'STP2'!AL21-'STP2'!AO21-'STP2'!AR21)","v":""},{"$f":"IF(A28=\"\",\"\",'STP2'!AT21)","v":""},{"$f":"IF(A28=\"\",\"\",R28-'STP2'!AU21)","v":""},"",{"$f":"IF(A28=\"\",\"\",'STP2'!CD21)","v":""},{"$f":"IF(A28=\"\",\"\",'STP2'!CE21)","v":""},{"$f":"IF(A28=\"\",\"\",'STP2'!CF21)","v":""},{"$f":"IF(A28=\"\",\"\",'STP2'!CG21)","v":""},{"$f":"IF(A28=\"\",\"\",'STP2'!CH21)","v":""},{"$f":"IF(A28=\"\",\"\",'STP2'!CI21)","v":""},{"$f":"IF(A28=\"\",\"\",'STP2'!CJ21)","v":""},{"$f":"IF(A28=\"\",\"\",'STP2'!CK21)","v":""},{"$f":"IF(A28=\"\",\"\",'STP2'!CL21)","v":""},{"$f":"IF(A28=\"\",\"\",'STP2'!CM21)","v":""},"",{"$f":"IF(A28=\"\",\"\",'STP2'!CN21)","v":""},{"$f":"IF(A28=\"\",\"\",'STP2'!CO21)","v":""},{"$f":"IF(A28=\"\",\"\",'STP2'!CP21)","v":""},{"$f":"IF(A28=\"\",\"\",'STP2'!CQ21)","v":""},{"$f":"IF(A28=\"\",\"\",'STP2'!CR21)","v":""},{"$f":"IF(A28=\"\",\"\",'STP2'!CS21)","v":""},{"$f":"IF(A28=\"\",\"\",'STP2'!CT21)","v":""},{"$f":"IF(A28=\"\",\"\",'STP2'!CU21)","v":""},{"$f":"IF(A28=\"\",\"\",'STP2'!CV21)","v":""},{"$f":"IF(A28=\"\",\"\",'STP2'!CW21)","v":""},"",{"$f":"IF(A28=\"\",\"\",'STP2'!CX21)","v":""},{"$f":"IF(A28=\"\",\"\",'STP2'!CY21)","v":""},{"$f":"IF(A28=\"\",\"\",'STP2'!CZ21)","v":""},{"$f":"IF(A28=\"\",\"\",'STP2'!DA21)","v":""},{"$f":"IF(A28=\"\",\"\",'STP2'!DB21)","v":""},{"$f":"IF(A28=\"\",\"\",'STP2'!DC21)","v":""},{"$f":"IF(A28=\"\",\"\",'STP2'!DD21)","v":""},{"$f":"IF(A28=\"\",\"\",'STP2'!DE21)","v":""},{"$f":"IF(A28=\"\",\"\",'STP2'!DF21)","v":""},{"$f":"IF(A28=\"\",\"\",'STP2'!DG21)","v":""},"",{"$f":"IF(A28=\"\",\"\",'STP2'!DH21)","v":""},{"$f":"IF(A28=\"\",\"\",'STP2'!DI21)","v":""},{"$f":"IF(A28=\"\",\"\",'STP2'!DJ21)","v":""},{"$f":"IF(A28=\"\",\"\",'STP2'!DK21)","v":""},{"$f":"IF(A28=\"\",\"\",'STP2'!DL21)","v":""},{"$f":"IF(A28=\"\",\"\",'STP2'!DM21)","v":""},{"$f":"IF(A28=\"\",\"\",'STP2'!DN21)","v":""},{"$f":"IF(A28=\"\",\"\",'STP2'!DO21)","v":""},{"$f":"IF(A28=\"\",\"\",'STP2'!DP21)","v":""},{"$f":"IF(A28=\"\",\"\",'STP2'!DQ21)","v":""},"",{"$f":"IF(A28=\"\",\"\",'STP2'!DR21)","v":""},{"$f":"IF(A28=\"\",\"\",'STP2'!DS21)","v":""},{"$f":"IF(A28=\"\",\"\",'STP2'!DT21)","v":""},{"$f":"IF(A28=\"\",\"\",'STP2'!DU21)","v":""},{"$f":"IF(A28=\"\",\"\",'STP2'!DV21)","v":""},{"$f":"IF(A28=\"\",\"\",'STP2'!DW21)","v":""},{"$f":"IF(A28=\"\",\"\",'STP2'!DX21)","v":""},{"$f":"IF(A28=\"\",\"\",'STP2'!DY21)","v":""},{"$f":"IF(A28=\"\",\"\",'STP2'!DZ21)","v":""},{"$f":"IF(A28=\"\",\"\",'STP2'!EA21)","v":""},"",{"$f":"IF(A28=\"\",\"\",'STP2'!EB21)","v":""},{"$f":"IF(A28=\"\",\"\",'STP2'!EC21)","v":""},{"$f":"IF(A28=\"\",\"\",'STP2'!ED21)","v":""},{"$f":"IF(A28=\"\",\"\",'STP2'!EE21)","v":""},{"$f":"IF(A28=\"\",\"\",'STP2'!EF21)","v":""},{"$f":"IF(A28=\"\",\"\",'STP2'!EG21)","v":""},{"$f":"IF(A28=\"\",\"\",'STP2'!EH21)","v":""},{"$f":"IF(A28=\"\",\"\",'STP2'!EI21)","v":""},{"$f":"IF(A28=\"\",\"\",'STP2'!EJ21)","v":""},{"$f":"IF(A28=\"\",\"\",'STP2'!EK21)","v":""},"",{"$f":"IF(A24=\"\",\"\",'STP2'!AV21)","v":""},{"$f":"IF(A24=\"\",\"\",'STP2'!AW21)","v":""},{"$f":"IF(A24=\"\",\"\",'STP2'!AX21)","v":""}]
[{"$f":"IF('STP2'!I22=\"99\",\"\",'STP2'!I22)","v":""},{"$f":"IF(A29=\"\",\"\",'STP2'!J22)","v":""},"",{"$f":"IF(A29=\"\",\"\",IF('STP2'!K22,\"ASO\",IF('STP2'!L22,\"SE\",IF('STP2'!M22,\"KB\",IF('STP2'!N22,\"SB\",IF('STP2'!O22,\"SI\",IF('STP2'!P22,\"MB\",\"S\")))))))","v":""},{"$f":"IF(A29=\"\",\"\",'STP2'!S22)","v":""},{"$f":"IF(A29=\"\",\"\",'STP2'!V22)","v":""},{"$f":"IF(A29=\"\",\"\",'STP2'!Y22)","v":""},{"$f":"IF(A29=\"\",\"\",'STP2'!AB22)","v":""},{"$f":"IF(A29=\"\",\"\",'STP2'!AE22)","v":""},"",{"$f":"IF(A29=\"\",\"\", J29-'STP2'!T22-'STP2'!W22-'STP2'!Z22-'STP2'!AC22-'STP2'!AF22)","v":""},{"$f":"IF(A29=\"\",\"\",'STP2'!AH22)","v":""},{"$f":"IF(A29=\"\",\"\",'STP2'!AK22)","v":""},{"$f":"IF(A29=\"\",\"\",'STP2'!AN22)","v":""},{"$f":"IF(A29=\"\",\"\",'STP2'!AQ22)","v":""},"",{"$f":"IF(A29=\"\",\"\",P29-'STP2'!AI22-'STP2'!AL22-'STP2'!AO22-'STP2'!AR22)","v":""},{"$f":"IF(A29=\"\",\"\",'STP2'!AT22)","v":""},{"$f":"IF(A29=\"\",\"\",R29-'STP2'!AU22)","v":""},"",{"$f":"IF(A29=\"\",\"\",'STP2'!CD22)","v":""},{"$f":"IF(A29=\"\",\"\",'STP2'!CE22)","v":""},{"$f":"IF(A29=\"\",\"\",'STP2'!CF22)","v":""},{"$f":"IF(A29=\"\",\"\",'STP2'!CG22)","v":""},{"$f":"IF(A29=\"\",\"\",'STP2'!CH22)","v":""},{"$f":"IF(A29=\"\",\"\",'STP2'!CI22)","v":""},{"$f":"IF(A29=\"\",\"\",'STP2'!CJ22)","v":""},{"$f":"IF(A29=\"\",\"\",'STP2'!CK22)","v":""},{"$f":"IF(A29=\"\",\"\",'STP2'!CL22)","v":""},{"$f":"IF(A29=\"\",\"\",'STP2'!CM22)","v":""},"",{"$f":"IF(A29=\"\",\"\",'STP2'!CN22)","v":""},{"$f":"IF(A29=\"\",\"\",'STP2'!CO22)","v":""},{"$f":"IF(A29=\"\",\"\",'STP2'!CP22)","v":""},{"$f":"IF(A29=\"\",\"\",'STP2'!CQ22)","v":""},{"$f":"IF(A29=\"\",\"\",'STP2'!CR22)","v":""},{"$f":"IF(A29=\"\",\"\",'STP2'!CS22)","v":""},{"$f":"IF(A29=\"\",\"\",'STP2'!CT22)","v":""},{"$f":"IF(A29=\"\",\"\",'STP2'!CU22)","v":""},{"$f":"IF(A29=\"\",\"\",'STP2'!CV22)","v":""},{"$f":"IF(A29=\"\",\"\",'STP2'!CW22)","v":""},"",{"$f":"IF(A29=\"\",\"\",'STP2'!CX22)","v":""},{"$f":"IF(A29=\"\",\"\",'STP2'!CY22)","v":""},{"$f":"IF(A29=\"\",\"\",'STP2'!CZ22)","v":""},{"$f":"IF(A29=\"\",\"\",'STP2'!DA22)","v":""},{"$f":"IF(A29=\"\",\"\",'STP2'!DB22)","v":""},{"$f":"IF(A29=\"\",\"\",'STP2'!DC22)","v":""},{"$f":"IF(A29=\"\",\"\",'STP2'!DD22)","v":""},{"$f":"IF(A29=\"\",\"\",'STP2'!DE22)","v":""},{"$f":"IF(A29=\"\",\"\",'STP2'!DF22)","v":""},{"$f":"IF(A29=\"\",\"\",'STP2'!DG22)","v":""},"",{"$f":"IF(A29=\"\",\"\",'STP2'!DH22)","v":""},{"$f":"IF(A29=\"\",\"\",'STP2'!DI22)","v":""},{"$f":"IF(A29=\"\",\"\",'STP2'!DJ22)","v":""},{"$f":"IF(A29=\"\",\"\",'STP2'!DK22)","v":""},{"$f":"IF(A29=\"\",\"\",'STP2'!DL22)","v":""},{"$f":"IF(A29=\"\",\"\",'STP2'!DM22)","v":""},{"$f":"IF(A29=\"\",\"\",'STP2'!DN22)","v":""},{"$f":"IF(A29=\"\",\"\",'STP2'!DO22)","v":""},{"$f":"IF(A29=\"\",\"\",'STP2'!DP22)","v":""},{"$f":"IF(A29=\"\",\"\",'STP2'!DQ22)","v":""},"",{"$f":"IF(A29=\"\",\"\",'STP2'!DR22)","v":""},{"$f":"IF(A29=\"\",\"\",'STP2'!DS22)","v":""},{"$f":"IF(A29=\"\",\"\",'STP2'!DT22)","v":""},{"$f":"IF(A29=\"\",\"\",'STP2'!DU22)","v":""},{"$f":"IF(A29=\"\",\"\",'STP2'!DV22)","v":""},{"$f":"IF(A29=\"\",\"\",'STP2'!DW22)","v":""},{"$f":"IF(A29=\"\",\"\",'STP2'!DX22)","v":""},{"$f":"IF(A29=\"\",\"\",'STP2'!DY22)","v":""},{"$f":"IF(A29=\"\",\"\",'STP2'!DZ22)","v":""},{"$f":"IF(A29=\"\",\"\",'STP2'!EA22)","v":""},"",{"$f":"IF(A29=\"\",\"\",'STP2'!EB22)","v":""},{"$f":"IF(A29=\"\",\"\",'STP2'!EC22)","v":""},{"$f":"IF(A29=\"\",\"\",'STP2'!ED22)","v":""},{"$f":"IF(A29=\"\",\"\",'STP2'!EE22)","v":""},{"$f":"IF(A29=\"\",\"\",'STP2'!EF22)","v":""},{"$f":"IF(A29=\"\",\"\",'STP2'!EG22)","v":""},{"$f":"IF(A29=\"\",\"\",'STP2'!EH22)","v":""},{"$f":"IF(A29=\"\",\"\",'STP2'!EI22)","v":""},{"$f":"IF(A29=\"\",\"\",'STP2'!EJ22)","v":""},{"$f":"IF(A29=\"\",\"\",'STP2'!EK22)","v":""},"",{"$f":"IF(A25=\"\",\"\",'STP2'!AV22)","v":""},{"$f":"IF(A25=\"\",\"\",'STP2'!AW22)","v":""},{"$f":"IF(A25=\"\",\"\",'STP2'!AX22)","v":""}]
[{"$f":"IF('STP2'!I23=\"99\",\"\",'STP2'!I23)","v":""},{"$f":"IF(A30=\"\",\"\",'STP2'!J23)","v":""},"",{"$f":"IF(A30=\"\",\"\",IF('STP2'!K23,\"ASO\",IF('STP2'!L23,\"SE\",IF('STP2'!M23,\"KB\",IF('STP2'!N23,\"SB\",IF('STP2'!O23,\"SI\",IF('STP2'!P23,\"MB\",\"S\")))))))","v":""},{"$f":"IF(A30=\"\",\"\",'STP2'!S23)","v":""},{"$f":"IF(A30=\"\",\"\",'STP2'!V23)","v":""},{"$f":"IF(A30=\"\",\"\",'STP2'!Y23)","v":""},{"$f":"IF(A30=\"\",\"\",'STP2'!AB23)","v":""},{"$f":"IF(A30=\"\",\"\",'STP2'!AE23)","v":""},"",{"$f":"IF(A30=\"\",\"\", J30-'STP2'!T23-'STP2'!W23-'STP2'!Z23-'STP2'!AC23-'STP2'!AF23)","v":""},{"$f":"IF(A30=\"\",\"\",'STP2'!AH23)","v":""},{"$f":"IF(A30=\"\",\"\",'STP2'!AK23)","v":""},{"$f":"IF(A30=\"\",\"\",'STP2'!AN23)","v":""},{"$f":"IF(A30=\"\",\"\",'STP2'!AQ23)","v":""},"",{"$f":"IF(A30=\"\",\"\",P30-'STP2'!AI23-'STP2'!AL23-'STP2'!AO23-'STP2'!AR23)","v":""},{"$f":"IF(A30=\"\",\"\",'STP2'!AT23)","v":""},{"$f":"IF(A30=\"\",\"\",R30-'STP2'!AU23)","v":""},"",{"$f":"IF(A30=\"\",\"\",'STP2'!CD23)","v":""},{"$f":"IF(A30=\"\",\"\",'STP2'!CE23)","v":""},{"$f":"IF(A30=\"\",\"\",'STP2'!CF23)","v":""},{"$f":"IF(A30=\"\",\"\",'STP2'!CG23)","v":""},{"$f":"IF(A30=\"\",\"\",'STP2'!CH23)","v":""},{"$f":"IF(A30=\"\",\"\",'STP2'!CI23)","v":""},{"$f":"IF(A30=\"\",\"\",'STP2'!CJ23)","v":""},{"$f":"IF(A30=\"\",\"\",'STP2'!CK23)","v":""},{"$f":"IF(A30=\"\",\"\",'STP2'!CL23)","v":""},{"$f":"IF(A30=\"\",\"\",'STP2'!CM23)","v":""},"",{"$f":"IF(A30=\"\",\"\",'STP2'!CN23)","v":""},{"$f":"IF(A30=\"\",\"\",'STP2'!CO23)","v":""},{"$f":"IF(A30=\"\",\"\",'STP2'!CP23)","v":""},{"$f":"IF(A30=\"\",\"\",'STP2'!CQ23)","v":""},{"$f":"IF(A30=\"\",\"\",'STP2'!CR23)","v":""},{"$f":"IF(A30=\"\",\"\",'STP2'!CS23)","v":""},{"$f":"IF(A30=\"\",\"\",'STP2'!CT23)","v":""},{"$f":"IF(A30=\"\",\"\",'STP2'!CU23)","v":""},{"$f":"IF(A30=\"\",\"\",'STP2'!CV23)","v":""},{"$f":"IF(A30=\"\",\"\",'STP2'!CW23)","v":""},"",{"$f":"IF(A30=\"\",\"\",'STP2'!CX23)","v":""},{"$f":"IF(A30=\"\",\"\",'STP2'!CY23)","v":""},{"$f":"IF(A30=\"\",\"\",'STP2'!CZ23)","v":""},{"$f":"IF(A30=\"\",\"\",'STP2'!DA23)","v":""},{"$f":"IF(A30=\"\",\"\",'STP2'!DB23)","v":""},{"$f":"IF(A30=\"\",\"\",'STP2'!DC23)","v":""},{"$f":"IF(A30=\"\",\"\",'STP2'!DD23)","v":""},{"$f":"IF(A30=\"\",\"\",'STP2'!DE23)","v":""},{"$f":"IF(A30=\"\",\"\",'STP2'!DF23)","v":""},{"$f":"IF(A30=\"\",\"\",'STP2'!DG23)","v":""},"",{"$f":"IF(A30=\"\",\"\",'STP2'!DH23)","v":""},{"$f":"IF(A30=\"\",\"\",'STP2'!DI23)","v":""},{"$f":"IF(A30=\"\",\"\",'STP2'!DJ23)","v":""},{"$f":"IF(A30=\"\",\"\",'STP2'!DK23)","v":""},{"$f":"IF(A30=\"\",\"\",'STP2'!DL23)","v":""},{"$f":"IF(A30=\"\",\"\",'STP2'!DM23)","v":""},{"$f":"IF(A30=\"\",\"\",'STP2'!DN23)","v":""},{"$f":"IF(A30=\"\",\"\",'STP2'!DO23)","v":""},{"$f":"IF(A30=\"\",\"\",'STP2'!DP23)","v":""},{"$f":"IF(A30=\"\",\"\",'STP2'!DQ23)","v":""},"",{"$f":"IF(A30=\"\",\"\",'STP2'!DR23)","v":""},{"$f":"IF(A30=\"\",\"\",'STP2'!DS23)","v":""},{"$f":"IF(A30=\"\",\"\",'STP2'!DT23)","v":""},{"$f":"IF(A30=\"\",\"\",'STP2'!DU23)","v":""},{"$f":"IF(A30=\"\",\"\",'STP2'!DV23)","v":""},{"$f":"IF(A30=\"\",\"\",'STP2'!DW23)","v":""},{"$f":"IF(A30=\"\",\"\",'STP2'!DX23)","v":""},{"$f":"IF(A30=\"\",\"\",'STP2'!DY23)","v":""},{"$f":"IF(A30=\"\",\"\",'STP2'!DZ23)","v":""},{"$f":"IF(A30=\"\",\"\",'STP2'!EA23)","v":""},"",{"$f":"IF(A30=\"\",\"\",'STP2'!EB23)","v":""},{"$f":"IF(A30=\"\",\"\",'STP2'!EC23)","v":""},{"$f":"IF(A30=\"\",\"\",'STP2'!ED23)","v":""},{"$f":"IF(A30=\"\",\"\",'STP2'!EE23)","v":""},{"$f":"IF(A30=\"\",\"\",'STP2'!EF23)","v":""},{"$f":"IF(A30=\"\",\"\",'STP2'!EG23)","v":""},{"$f":"IF(A30=\"\",\"\",'STP2'!EH23)","v":""},{"$f":"IF(A30=\"\",\"\",'STP2'!EI23)","v":""},{"$f":"IF(A30=\"\",\"\",'STP2'!EJ23)","v":""},{"$f":"IF(A30=\"\",\"\",'STP2'!EK23)","v":""},"",{"$f":"IF(A26=\"\",\"\",'STP2'!AV23)","v":""},{"$f":"IF(A26=\"\",\"\",'STP2'!AW23)","v":""},{"$f":"IF(A26=\"\",\"\",'STP2'!AX23)","v":""}]
["Gesamtsumme",null,null,null,{"$f":"SUM(E9:E30)","v":0},{"$f":"SUM(F9:F30)","v":1},1,8,5,15,0,11,21,24,22,78,10,42,0,135,{"$f":"SUM(U9:U30)","v":0},0,0,3,5,7,15,14,8,29,81,0,0,0,1,0,1,2,2,5,0,11,0,0,1,4,0,2,4,2,7,13,{"$f":"SUM(BA9:BA30)","v":33},0,0,0,0,0,0,0,0,0,0,0,0,0,0,0,0,0,0,0,0,0,0,0,1,0,0,0,0,0,0,0,{"$f":"SUM(CG9:CG30)","v":0},{"$f":"SUM(CH9:CH30)","v":1},{"$f":"SUM(CI9:CI30)","v":90},{"$f":"SUM(CJ9:CJ30)","v":0},{"$f":"SUM(CK9:CK30)","v":0}]
["Gesamt-St.0",null,{"$f":"COUNTIF(A9:A30,\"00\")","v":0},null,{"$f":"E31","v":0},null,null,null,null,null,null,null,null,null,null,null,null,null,null,{"$f":"E32","v":0}]
["Gesamt-St.1-4",null,{"$f":"COUNTIF(A9:A30,\"01\")+COUNTIF(A9:A30,\"02\")+COUNTIF(A9:A30,\"03\")+COUNTIF(A9:A30,\"04\")","v":1},null,null,{"$f":"F31","v":1},1,8,5,{"$f":"SUM(F33:I33)","v":15},0,null,null,null,null,null,null,null,null,{"$f":"J33","v":15}]
["Gesamt-St.5-8",null,{"$f":"COUNTIF(A9:A30,\"05\")+COUNTIF(A9:A30,\"06\")+COUNTIF(A9:A30,\"07\")+COUNTIF(A9:A30,\"08\")","v":8},null,null,null,null,null,null,null,null,{"$f":"L31","v":11},21,24,22,78,10,null,null,{"$f":"P34","v":78}]
["Gesamt-St.9",null,{"$f":"COUNTIF(A9:A30,\"09\")","v":5},null,null,null,null,null,null,null,null,null,null,null,null,null,null,{"$f":"R31","v":42},{"$f":"S31","v":0},{"$f":"R35","v":42}]
["Anzahl Klassen",null,{"$f":"SUM(C32:C35)","v":14},null,null,"Differenz zw. GesamtschülerInnenzahl und Summe der \"SchülerInnenarten\": ",null,null,null,null,null,null,null,null,null,null,null,null,null,{"$f":"(AE31+AP31+BA31+BL31+BW31+CH31)-(T31-S31-Q31-K31)","v":1}]
[]
["Status / Schuljahr",null,null,null,null,null,null,null,"STELLENPLAN",null,null,null,null,null,null,null,null,null,{"$f":"S1","v":"SO Salzburg - 501013"}]
[{"$f":"A2","v":"Endg. Stellenplan 2021/22"},null,null,null,null,null,null,null,"Land Salzburg",null,null,null,null,null,null,null,null,null,{"$f":"S2","v":"Salzburg-Stadt"}]
[{"$f":"A3","v":"Genehmigungsstatus: genehmigt"},null,null,null,null,null,null,null,{"$f":"I3","v":"Version 9.1"},null,null,null,null,null,null,null,null,null,{"$f":"S3","v":"Stichtag: 01.10.2021"}]
[]
[]
[]
[]
[]
[]
["Geplanter Einsatz von Wochenstunden für:",null,null,null,null,null,null,null,null,"Religionen: ","Schüler",null,"Gruppen",null,"Wst.",null,null,"Schüler",null,"Gruppen",null,null,null,null,null,null,null,null,null,null,null,null,null,null,null,null,null,null,null,null,null,null,null,null,null,null,null,null,null,null,null,null,null,null,null,null,null,null,null,null,null,null,null,null,null,null,null,null,null,null,null,null,null,null,null,null,null,null,null,null,null,null,null,null,null,null,"Wst."]
[null,null,null,null,null,null,null,"röm.-kath.",null,null,{"$f":"'STP1'!AW2-'STP1'!AX2+'STP1'!AY2","v":15},null,{"$f":"'STP3'!AD2","v":3},null,{"$f":"'STP3'!AE2","v":3},null,"ev.",{"$f":"'STP1'!AZ2-'STP1'!BA2+'STP1'!BB2","v":0},null,{"$f":"'STP3'!AF2","v":0},null,null,null,null,null,null,null,null,null,null,null,null,null,null,null,null,null,null,null,null,null,null,null,null,null,null,null,null,null,null,null,null,null,null,null,null,null,null,null,null,null,null,null,null,null,null,null,null,null,null,null,null,null,null,null,null,null,null,null,null,null,null,null,null,null,null,{"$f":"'STP3'!AG2","v":0}]
[null,null,null,null,null,null,null,"islam.",null,null,{"$f":"'STP1'!BC2-'STP1'!BD2+'STP1'!BE2","v":14},null,{"$f":"'STP3'!AH2","v":3},null,{"$f":"'STP3'!AI2","v":3},null,"orth.",{"$f":"'STP1'!BF2-'STP1'!BG2+'STP1'!BH2","v":0},null,{"$f":"'STP3'!AJ2","v":0},null,null,null,null,null,null,null,null,null,null,null,null,null,null,null,null,null,null,null,null,null,null,null,null,null,null,null,null,null,null,null,null,null,null,null,null,null,null,null,null,null,null,null,null,null,null,null,null,null,null,null,null,null,null,null,null,null,null,null,null,null,null,null,null,null,null,{"$f":"'STP3'!AK2","v":0}]
[null,null,null,null,null,null,null,"sonstige",null,null,{"$f":"'STP1'!BI2-'STP1'!BJ2+'STP1'!BK2","v":0},null,{"$f":"'STP3'!AL2","v":0},null,{"$f":"'STP3'!AM2","v":0}]
[]
["Geplante Ganztägige Schulform:",null,null,null,null,null,null,null,null,null,null,"SchülerInnen:",null,null,{"$f":"'STP1'!BW2+'STP1'!BX2+'STP1'!BY2+'STP1'!BZ2+'STP1'!CA2","v":47},null,null,"Gruppen:",null,null,null,null,null,null,null,null,null,null,null,null,null,null,null,null,null,null,null,null,null,null,null,null,null,null,null,null,null,null,null,null,null,null,null,null,null,null,null,null,null,null,null,null,null,null,null,null,null,null,null,null,null,null,null,null,null,null,null,null,null,null,null,null,null,null,null,null,{"$f":"'STP3'!N2","v":5}]
[null,null,null,null,"gegenstandsbezogene Lernzeit:",null,null,null,null,null,null,null,null,null,{"$f":"'STP3'!O2","v":30},null,null,"individuelle Lernzeit:",null,null,null,null,null,null,null,null,null,null,null,null,null,null,null,null,null,null,null,null,null,null,null,null,null,null,null,null,null,null,null,null,null,null,null,null,null,null,null,null,null,null,null,null,null,null,null,null,null,null,null,null,null,null,null,null,null,null,null,null,null,null,null,null,null,null,null,null,{"$f":"'STP3'!P2","v":0}]
[]
[]
[]
["Schulversuchsstunden lt. Aufstellung - auslaufend: ",null,null,null,null,null,null,null,null,null,null,null,null,null,null,"SV1: ",{"$f":"'STP3'!Q2","v":37},"SV2: ",{"$f":"'STP3'!R2","v":0},"SV3: ",null,null,null,null,null,null,null,null,null,null,null,null,null,null,null,null,null,null,null,null,null,null,null,null,null,null,null,null,null,null,null,null,null,null,null,null,null,null,null,null,null,null,null,null,null,null,null,null,null,null,null,null,null,null,null,null,null,null,null,null,null,null,null,null,null,null,{"$f":"'STP3'!S2","v":0}]
[]
["Berechnung des fixen \"Sockelkontingentes\" ohne Stunden für GTS, SV, BFD!",null,null,null,null,null,null,null,null,null,null,null,null,null,null,null,null,null,null,null,null,null,null,null,null,null,null,null,null,null,null,null,null,null,null,null,null,null,null,null,null,null,null,null,null,null,null,null,null,null,null,null,null,null,null,null,null,null,null,null,null,null,null,null,null,null,null,null,null,null,null,null,null,null,null,null,null,null,null,null,null,null,null,null,null,null,null,null,"Summen:"]
[]
["1. Anzahl SchülerInnen nach Lehrplangruppen:",null,null,null,null,null,null,null,"ASO",null,"SE",null,"SB",null,"KB",null,"MB",null,"SI",null,null,null,null,null,null,null,null,null,null,null,null,null,null,null,null,null,null,null,null,null,null,null,null,null,null,null,null,null,null,null,null,null,null,null,null,null,null,null,null,null,null,null,null,null,null,null,null,null,null,null,null,null,null,null,null,null,null,null,null,null,null,null,null,null,null,null,"Summe:"]
[null,null,null,null,null,null,null,null,{"$f":"AE31","v":81},null,{"$f":"AP31","v":11},null,{"$f":"BA31","v":33},null,{"$f":"BL31","v":0},null,{"$f":"BW31","v":0},null,{"$f":"CH31","v":1},null,null,null,null,null,null,null,null,null,null,null,null,null,null,null,null,null,null,null,null,null,null,null,null,null,null,null,null,null,null,null,null,null,null,null,null,null,null,null,null,null,null,null,null,null,null,null,null,null,null,null,null,null,null,null,null,null,null,null,null,null,null,null,null,null,null,null,{"$f":"SUM(CI63:CI65)","v":126}]
[null,null,null,null,null,null,null,"davon 0. bis 4. Stufe:",{"$f":"U31+V31+W31+X31+Y31","v":8},null,{"$f":"AF31+AG31+AH31+AI31+AJ31","v":1},null,{"$f":"AQ31+AR31+AS31+AT31+AU31","v":5},null,{"$f":"BB31+BC31+BD31+BE31+BF31","v":0},null,{"$f":"BM31+BN31+BO31+BP31+BQ31","v":0},null,{"$f":"BX31+BY31+BZ31+CA31+CB31","v":1},null,null,null,null,null,null,null,null,null,null,null,null,null,null,null,null,null,null,null,null,null,null,null,null,null,null,null,null,null,null,null,null,null,null,null,null,null,null,null,null,null,null,null,null,null,null,null,null,null,null,null,null,null,null,null,null,null,null,null,null,null,null,null,null,null,null,null,{"$f":"I63+K63+M63+O63+Q63+S63","v":15}]
[null,null,null,null,null,null,null,"davon 5. bis 8. Stufe:",{"$f":"Z31+AA31+AB31+AC31","v":44},null,{"$f":"AK31+AL31+AM31+AN31","v":10},null,{"$f":"AV31+AW31+AX31+AY31","v":15},null,{"$f":"BG31+BH31+BI31+BJ31","v":0},null,{"$f":"BR31+BS31+BT31+BU31","v":0},null,{"$f":"CC31+CD31+CE31+CF31","v":0},null,null,null,null,null,null,null,null,null,null,null,null,null,null,null,null,null,null,null,null,null,null,null,null,null,null,null,null,null,null,null,null,null,null,null,null,null,null,null,null,null,null,null,null,null,null,null,null,null,null,null,null,null,null,null,null,null,null,null,null,null,null,null,null,null,null,null,{"$f":"I64+K64+M64+O64+Q64+S64","v":69}]
[null,null,null,null,null,null,null,"davon 9. Stufe:",{"$f":"AD31","v":29},null,{"$f":"AO31","v":0},null,{"$f":"AZ31","v":13},null,{"$f":"BK31","v":0},null,{"$f":"BV31","v":0},null,{"$f":"CG31","v":0},null,null,null,null,null,null,null,null,null,null,null,null,null,null,null,null,null,null,null,null,null,null,null,null,null,null,null,null,null,null,null,null,null,null,null,null,null,null,null,null,null,null,null,null,null,null,null,null,null,null,null,null,null,null,null,null,null,null,null,null,null,null,null,null,null,null,null,{"$f":"I65+K65+M65+O65+Q65+S65","v":42}]
[]
[]
[]
["2. Ermittlung fiktiver Lehrplangruppen:",null,null,null,null,null,"Lehrplan: ",null,"Schü.:",null,null,"Faktor","Summe:"]
[null,null,null,null,null,null,"ASO + SI: ",null,"alle",{"$f":"I$62+S$62","v":82},"x",1,{"$f":"IF(RIGHT($S$1,6)=\"501033\",$I$62*1+$S$62*1.25,$I$62+$S$62*1)","v":82},null,"bei 'SKZ 501033: SI*1,25"]
[null,null,null,null,null,null,"SB, MB, KB: ",null,"1-15",{"$f":"IF((M$62+O$62+Q$62)<16,M$62+O$62+Q$62,0)","v":0},"x",2,{"$f":"J71*L71","v":0}]
[null,null,null,null,null,null,null,null,"1-20",{"$f":"IF(AND((M$62+O$62+Q$62)>15,(M$62+O$62+Q$62)<21),M$62+O$62+Q$62,0)","v":0},"x",1.9,0,null,"Summe:"]
[null,null,null,null,null,null,null,null,"1-25",{"$f":"IF(AND((M$62+O$62+Q$62)>20,(M$62+O$62+Q$62)<26),M$62+O$62+Q$62,0)","v":0},"x",1.8,0,null,{"$f":"SUM(M70:M77)","v":159},"=",null,null,"Anzahl LP-Gruppen:",{"$f":"$O$73/$O$74","v":15.9}]
[null,null,null,null,null,null,null,null,"ab 26",{"$f":"IF((M$62+O$62+Q$62)>25,M$62+O$62+Q$62,0)","v":33},"x",1.7,56.1,null,10]
[null,null,null,null,null,null,"SE: ",null,"1-10",{"$f":"IF(K$62<11,K$62,0)","v":0},"x",2,0]
[null,null,null,null,null,null,null,null,"1-15",{"$f":"IF(AND(K$62>10,K$62<16),K$62,0)","v":11},"x",1.9,20.9]
[null,null,null,null,null,null,null,null,"ab 16",{"$f":"IF(K$62>15,K$62,0)","v":0},"x",1.8,0]
[]
["3. Durchschnittliche SchülerInnenzahl in \"Lehrplangruppen\":",null,null,null,null,null,null,null,null,null,null,null,null,null,null,null,null,"Gesamt-SchülerInnen / Anz. LP-Gruppen","=",{"$f":"(I62+K62+M62+O62+Q62+S62)/T73","v":7.9245283018867925}]
[]
["4. Berechnung von Wochenstunden für Lehrplangruppen (Ø-Werte):",null,null,null,null,null,null,null,null,null,null,null,"Für alle Schulen gilt der ASO-Lehrplan - Ausnahmen: ABK-Schule + J. Rehrl-Schule"]
[]
[]
["Wstd. pro LP-Gruppe:",null,null,null,"Stufe","ASO","SB","J.Rehrl",null,"LP-Gr.:",null,"Wstd.",null,null,null,null,null,null,null,null,null,null,null,null,null,null,null,null,null,null,null,null,null,null,null,null,null,null,null,null,null,null,null,null,null,null,null,null,null,null,null,null,null,null,null,null,null,null,null,null,null,null,null,null,null,null,null,null,null,null,null,null,null,null,null,null,null,null,null,null,null,null,null,null,null,null,null,"Summe Wstd. \"Lehrplangruppen\":"]
[null,null,null,null,"0.-4.:",22.5,23.5,26.5,null,{"$f":"CI$63/T$79","v":1.8928571428571428},null,{"$f":"IF(RIGHT($S$1,6)=\"501023\",$G$85*$J$85,IF(RIGHT($S$1,6)=\"501033\",$H$85*$J$85,$F$85*$J$85))","v":42.589285714285715},null,null,null,null,null,null,null,null,null,null,null,null,null,null,null,null,null,null,null,null,null,null,null,null,null,null,null,null,null,null,null,null,null,null,null,null,null,null,null,null,null,null,null,null,null,null,null,null,null,null,null,null,null,null,null,null,null,null,null,null,null,null,null,null,null,null,null,null,null,null,null,null,null,null,null,"Sonderschule:",{"$f":"IF(OR((RIGHT($S$1,6)=\"501023\"),(RIGHT($S$1,6)=\"501033\")),0,(($CI$63/$T$79*$F$85)+($CI$64/$T$79)*$F$86)+($CI$65/$T$79)*$F$87)","v":454.09642857142859}]
[null,null,null,null,"5.-8.:",29,26.5,32,null,{"$f":"CI$64/T$79","v":8.7071428571428573},null,{"$f":"IF(RIGHT($S$1,6)=\"501023\",$G$86*$J$86,IF(RIGHT($S$1,6)=\"501033\",$H$86*$J$86,$F$86*$J$86))","v":252.50714285714287},null,null,null,null,null,null,null,null,null,null,null,null,null,null,null,null,null,null,null,null,null,null,null,null,null,null,null,null,null,null,null,null,null,null,null,null,null,null,null,null,null,null,null,null,null,null,null,null,null,null,null,null,null,null,null,null,null,null,null,null,null,null,null,null,null,null,null,null,null,null,null,null,null,null,null,"ABK-Schule:",{"$f":"IF(RIGHT($S$1,6)=\"501023\",($CI$63/$T$79)*$G$85+($CI$64/$T$79)*$G$86+($CI$65/$T$79)*$G$87,0)","v":0}]
[null,null,null,null,"9.:",30,27,33,null,{"$f":"CI$65/T$79","v":5.3},null,{"$f":"IF(RIGHT($S$1,6)=\"501023\",$G$87*$J$87,IF(RIGHT($S$1,6)=\"501033\",$H$87*$J$87,$F$87*$J$87))","v":159},null,null,null,null,null,null,null,null,null,null,null,null,null,null,null,null,null,null,null,null,null,null,null,null,null,null,null,null,null,null,null,null,null,null,null,null,null,null,null,null,null,null,null,null,null,null,null,null,null,null,null,null,null,null,null,null,null,null,null,null,null,null,null,null,null,null,null,null,null,null,null,null,null,null,null,"J. Rehrl Schule:",{"$f":"IF(RIGHT($S$1,6)=\"501033\",($CI$63/$T$79)*$H$85+($CI$64/$T$79)*$H$86+($CI$65/$T$79)*$H$87,0)","v":0}]
[]
["5. Berechnung \"Teilungen\" und \"Förderstunden\": inkl. SchülerInnen \"umgekehrte Integration\" "]
[]
[null,"BSP:",{"$f":"($P$31+$R$31)/10*3","v":36}," (Schü. 5.-9.St.)",null,null,"WE, EH:",null,{"$f":"($P$31+$R$31)/10*1.5","v":18}," (Schü. 5.-9.St.)",null,null,null,"Förderstd.:",{"$f":"($J$31/$T$79)*1+(($P$31+$R$31)/$T$79)*2","v":32.178571428571431}," (Schü. 1. - 9. St.)",null,null,null,null,null,null,null,null,null,null,null,null,null,null,null,null,null,null,null,null,null,null,null,null,null,null,null,null,null,null,null,null,null,null,null,null,null,null,null,null,null,null,null,null,null,null,null,null,null,null,null,null,null,null,null,null,null,null,null,null,null,null,null,null,null,null,null,null,null,null,null,"Summe: ",{"$f":"C91+I91+O91","v":86.178571428571431}]
[]
[]
[]
["6. SonderschulleiterInnen (Abzugsstunden):",null,null,null,null,null,null,"(Schulleiter/innen im PD-Schema sind gesondert zu berücksichtigen!)",null,null,null,null,null,null,null,null,null,null,null,null,null,null,null,null,null,null,null,null,null,null,null,null,null,null,null,null,null,null,null,null,null,null,null,null,null,null,null,null,null,null,null,null,null,null,null,null,null,null,null,null,null,null,null,null,null,null,null,null,null,null,null,null,null,null,null,null,null,null,null,null,null,null,null,null,null,null,null,null,{"$f":"IF(($C$36+$CI$52/2)>7.5,20,($C$36*1.5+2+$CI$52*0.75))","v":20}]
[]
["6. Ganztägige Schulform:",null,null,null,null,null,null,null,null,null,"SchülerInnen:",null,null,null,{"$f":"O52","v":47},null,null,"Gruppen:",null,null,null,null,null,null,null,null,null,null,null,null,null,null,null,null,null,null,null,null,null,null,null,null,null,null,null,null,null,null,null,null,null,null,null,null,null,null,null,null,null,null,null,null,null,null,null,null,null,null,null,null,null,null,null,null,null,null,null,null,null,null,null,null,null,null,null,null,{"$f":"CI52","v":5},null,{"$f":"CI97*5","v":25}]
[]
["7. Schulversuchsstunden:",null,null,null,null,null,null,null,null,null,null,null,"SV 1:",null,{"$f":"'STP3'!$Q$2","v":37},null,"SV 2:",{"$f":"'STP3'!$R$2","v":0},null,"SV 3:",null,null,null,null,null,null,null,null,null,null,null,null,null,null,null,null,null,null,null,null,null,null,null,null,null,null,null,null,null,null,null,null,null,null,null,null,null,null,null,null,null,null,null,null,null,null,null,null,null,null,null,null,null,null,null,null,null,null,null,null,null,null,null,null,null,null,{"$f":"'STP3'!$S$2","v":0},null,{"$f":"O99+R99+CI99","v":37}]
[]
["8. Mobiler sonderpädagogischer Dienst (nur für SPZ):",null,null,null,null,null,null,null,null,null,"Sprachheilstunden:",null,null,null,{"$f":"O55","v":0},null,null,"Beratungsstunden:",null,null,null,null,null,null,null,null,null,null,null,null,null,null,null,null,null,null,null,null,null,null,null,null,null,null,null,null,null,null,null,null,null,null,null,null,null,null,null,null,null,null,null,null,null,null,null,null,null,null,null,null,null,null,null,null,null,null,null,null,null,null,null,null,null,null,null,null,{"$f":"CI55","v":0},null,{"$f":"O101+CI101","v":0}]
[]
["Fixes Sockelkontingent ohne GTS, SV, BFD: ",null,null,null,null,null,null,null,null,null,null,null,null,null,null,null,null,null,null,{"$f":"IF(RIGHT(S1,6)=\"501123\",\"Fixkontingent: \",\"Sockelkontingent: \")","v":"Sockelkontingent: "},null,null,null,null,null,null,null,null,null,null,null,null,null,null,null,null,null,null,null,null,null,null,null,null,null,null,null,null,null,null,null,null,null,null,null,null,null,null,null,null,null,null,null,null,null,null,null,null,null,null,null,null,null,null,null,null,null,null,null,null,null,null,null,null,null,null,null,null,{"$f":"ROUND(IF(RIGHT(S1,6)=\"501123\",400,CK85+CK86+CK87+CK91+CK95),0)","v":560}]

{"sheet":"STP1","index":1,"n_rows":2,"n_cols":148,"rows_kept":2,"cut":false,"hidden":false,"merged":[]}
[{"$f":"'[1]311 SO-Schule'!B1","v":"Schuljahr"},{"$f":"'[1]311 SO-Schule'!C1","v":"BezirkNr"},{"$f":"'[1]311 SO-Schule'!D1","v":"Schultyp"},{"$f":"'[1]311 SO-Schule'!E1","v":"SKZ"},{"$f":"'[1]311 SO-Schule'!F1","v":"Schule"},{"$f":"'[1]311 SO-Schule'!G1","v":"Status"},{"$f":"'[1]311 SO-Schule'!H1","v":"Stichtag"},{"$f":"'[1]311 SO-Schule'!I1","v":"Schulart"},{"$f":"'[1]311 SO-Schule'!J1","v":"Kl_Art_ASO"},{"$f":"'[1]311 SO-Schule'!K1","v":"Kl_Art_SE"},{"$f":"'[1]311 SO-Schule'!L1","v":"Kl_Art_KB"},{"$f":"'[1]311 SO-Schule'!M1","v":"Kl_Art_SB"},{"$f":"'[1]311 SO-Schule'!N1","v":"Kl_Art_SI"},{"$f":"'[1]311 SO-Schule'!O1","v":"Kl_Art_MB"},{"$f":"'[1]311 SO-Schule'!P1","v":"Kl_Anz"},{"$f":"'[1]311 SO-Schule'!Q1","v":"Kl0"},{"$f":"'[1]311 SO-Schule'!R1","v":"Anz0"},{"$f":"'[1]311 SO-Schule'!S1","v":"SPF0"},{"$f":"'[1]311 SO-Schule'!T1","v":"Kl1"},{"$f":"'[1]311 SO-Schule'!U1","v":"Anz1"},{"$f":"'[1]311 SO-Schule'!V1","v":"SPF1"},{"$f":"'[1]311 SO-Schule'!W1","v":"Kl2"},{"$f":"'[1]311 SO-Schule'!X1","v":"Anz2"},{"$f":"'[1]311 SO-Schule'!Y1","v":"SPF2"},{"$f":"'[1]311 SO-Schule'!Z1","v":"Kl3"},{"$f":"'[1]311 SO-Schule'!AA1","v":"Anz3"},{"$f":"'[1]311 SO-Schule'!AB1","v":"SPF3"},{"$f":"'[1]311 SO-Schule'!AC1","v":"Kl4"},{"$f":"'[1]311 SO-Schule'!AD1","v":"Anz4"},{"$f":"'[1]311 SO-Schule'!AE1","v":"SPF4"},{"$f":"'[1]311 SO-Schule'!AF1","v":"Kl5"},{"$f":"'[1]311 SO-Schule'!AG1","v":"Anz5"},{"$f":"'[1]311 SO-Schule'!AH1","v":"SPF5"},{"$f":"'[1]311 SO-Schule'!AI1","v":"Kl6"},{"$f":"'[1]311 SO-Schule'!AJ1","v":"Anz6"},{"$f":"'[1]311 SO-Schule'!AK1","v":"SPF6"},{"$f":"'[1]311 SO-Schule'!AL1","v":"Kl7"},{"$f":"'[1]311 SO-Schule'!AM1","v":"Anz7"},{"$f":"'[1]311 SO-Schule'!AN1","v":"SPF7"},{"$f":"'[1]311 SO-Schule'!AO1","v":"Kl8"},{"$f":"'[1]311 SO-Schule'!AP1","v":"Anz8"},{"$f":"'[1]311 SO-Schule'!AQ1","v":"SPF8"},{"$f":"'[1]311 SO-Schule'!AR1","v":"Kl9"},{"$f":"'[1]311 SO-Schule'!AS1","v":"Anz9"},{"$f":"'[1]311 SO-Schule'!AT1","v":"SPF9"},{"$f":"'[1]311 SO-Schule'!AU1","v":"NDSprache"},{"$f":"'[1]311 SO-Schule'!AV1","v":"AO"},{"$f":"'[1]311 SO-Schule'!AW1","v":"SprengelF"},{"$f":"'[1]311 SO-Schule'!AX1","v":"Rel_RK"},{"$f":"'[1]311 SO-Schule'!AY1","v":"Rel_RK_Abmeld"},{"$f":"'[1]311 SO-Schule'!AZ1","v":"Rel_RK_FG"},{"$f":"'[1]311 SO-Schule'!BA1","v":"Rel_EV"},{"$f":"'[1]311 SO-Schule'!BB1","v":"Rel_EV_Abmeld"},{"$f":"'[1]311 SO-Schule'!BC1","v":"Rel_EV_FG"},{"$f":"'[1]311 SO-Schule'!BD1","v":"Rel_ISL"},{"$f":"'[1]311 SO-Schule'!BE1","v":"Rel_ISL_Abmeld"},{"$f":"'[1]311 SO-Schule'!BF1","v":"Rel_ISL_FG"},{"$f":"'[1]311 SO-Schule'!BG1","v":"Rel_ORTH"},{"$f":"'[1]311 SO-Schule'!BH1","v":"Rel_ORTH_Abmeld"},{"$f":"'[1]311 SO-Schule'!BI1","v":"Rel_ORTH_FG"},{"$f":"'[1]311 SO-Schule'!BJ1","v":"Rel_SONST"},{"$f":"'[1]311 SO-Schule'!BK1","v":"Rel_SONST_Abmeld"},{"$f":"'[1]311 SO-Schule'!BL1","v":"Rel_SONST_FG"},{"$f":"'[1]311 SO-Schule'!BM1","v":"I_Klassen"},{"$f":"'[1]311 SO-Schule'!BN1","v":"Anz_I1"},{"$f":"'[1]311 SO-Schule'!BO1","v":"Anz_I2"},{"$f":"'[1]311 SO-Schule'!BP1","v":"Anz_I3"},{"$f":"'[1]311 SO-Schule'!BQ1","v":"Anz_I4"},{"$f":"'[1]311 SO-Schule'!BR1","v":"Anz_I5"},{"$f":"'[1]311 SO-Schule'!BS1","v":"Anz_I6"},{"$f":"'[1]311 SO-Schule'!BT1","v":"Anz_I7"},{"$f":"'[1]311 SO-Schule'!BU1","v":"Anz_I8"},{"$f":"'[1]311 SO-Schule'!BV1","v":"Anz_I9"},{"$f":"'[1]311 SO-Schule'!BW1","v":"Anz_I10"},{"$f":"'[1]311 SO-Schule'!BX1","v":"GTS_1Tag"},{"$f":"'[1]311 SO-Schule'!BY1","v":"GTS_2Tage"},{"$f":"'[1]311 SO-Schule'!BZ1","v":"GTS_3Tage"},{"$f":"'[1]311 SO-Schule'!CA1","v":"GTS_4Tage"},{"$f":"'[1]311 SO-Schule'!CB1","v":"GTS_5Tage"},{"$f":"'[1]311 SO-Schule'!CC1","v":"ASO_0"},{"$f":"'[1]311 SO-Schule'!CD1","v":"ASO_1"},{"$f":"'[1]311 SO-Schule'!CE1","v":"ASO_2"},{"$f":"'[1]311 SO-Schule'!CF1","v":"ASO_3"},{"$f":"'[1]311 SO-Schule'!CG1","v":"ASO_4"},{"$f":"'[1]311 SO-Schule'!CH1","v":"ASO_5"},{"$f":"'[1]311 SO-Schule'!CI1","v":"ASO_6"},{"$f":"'[1]311 SO-Schule'!CJ1","v":"ASO_7"},{"$f":"'[1]311 SO-Schule'!CK1","v":"ASO_8"},{"$f":"'[1]311 SO-Schule'!CL1","v":"ASO_9"},{"$f":"'[1]311 SO-Schule'!CM1","v":"SE_0"},{"$f":"'[1]311 SO-Schule'!CN1","v":"SE_1"},{"$f":"'[1]311 SO-Schule'!CO1","v":"SE_2"},{"$f":"'[1]311 SO-Schule'!CP1","v":"SE_3"},{"$f":"'[1]311 SO-Schule'!CQ1","v":"SE_4"},{"$f":"'[1]311 SO-Schule'!CR1","v":"SE_5"},{"$f":"'[1]311 SO-Schule'!CS1","v":"SE_6"},{"$f":"'[1]311 SO-Schule'!CT1","v":"SE_7"},{"$f":"'[1]311 SO-Schule'!CU1","v":"SE_8"},{"$f":"'[1]311 SO-Schule'!CV1","v":"SE_9"},{"$f":"'[1]311 SO-Schule'!CW1","v":"SB_0"},{"$f":"'[1]311 SO-Schule'!CX1","v":"SB_1"},{"$f":"'[1]311 SO-Schule'!CY1","v":"SB_2"},{"$f":"'[1]311 SO-Schule'!CZ1","v":"SB_3"},{"$f":"'[1]311 SO-Schule'!DA1","v":"SB_4"},{"$f":"'[1]311 SO-Schule'!DB1","v":"SB_5"},{"$f":"'[1]311 SO-Schule'!DC1","v":"SB_6"},{"$f":"'[1]311 SO-Schule'!DD1","v":"SB_7"},{"$f":"'[1]311 SO-Schule'!DE1","v":"SB_8"},{"$f":"'[1]311 SO-Schule'!DF1","v":"SB_9"},{"$f":"'[1]311 SO-Schule'!DG1","v":"KB_0"},{"$f":"'[1]311 SO-Schule'!DH1","v":"KB_1"},{"$f":"'[1]311 SO-Schule'!DI1","v":"KB_2"},{"$f":"'[1]311 SO-Schule'!DJ1","v":"KB_3"},{"$f":"'[1]311 SO-Schule'!DK1","v":"KB_4"},{"$f":"'[1]311 SO-Schule'!DL1","v":"KB_5"},{"$f":"'[1]311 SO-Schule'!DM1","v":"KB_6"},{"$f":"'[1]311 SO-Schule'!DN1","v":"KB_7"},{"$f":"'[1]311 SO-Schule'!DO1","v":"KB_8"},{"$f":"'[1]311 SO-Schule'!DP1","v":"KB_9"},{"$f":"'[1]311 SO-Schule'!DQ1","v":"MB_0"},{"$f":"'[1]311 SO-Schule'!DR1","v":"MB_1"},{"$f":"'[1]311 SO-Schule'!DS1","v":"MB_2"},{"$f":"'[1]311 SO-Schule'!DT1","v":"MB_3"},{"$f":"'[1]311 SO-Schule'!DU1","v":"MB_4"},{"$f":"'[1]311 SO-Schule'!DV1","v":"MB_5"},{"$f":"'[1]311 SO-Schule'!DW1","v":"MB_6"},{"$f":"'[1]311 SO-Schule'!DX1","v":"MB_7"},{"$f":"'[1]311 SO-Schule'!DY1","v":"MB_8"},{"$f":"'[1]311 SO-Schule'!DZ1","v":"MB_9"},{"$f":"'[1]311 SO-Schule'!EA1","v":"SI_0"},{"$f":"'[1]311 SO-Schule'!EB1","v":"SI_1"},{"$f":"'[1]311 SO-Schule'!EC1","v":"SI_2"},{"$f":"'[1]311 SO-Schule'!ED1","v":"SI_3"},{"$f":"'[1]311 SO-Schule'!EE1","v":"SI_4"},{"$f":"'[1]311 SO-Schule'!EF1","v":"SI_5"},{"$f":"'[1]311 SO-Schule'!EG1","v":"SI_6"},{"$f":"'[1]311 SO-Schule'!EH1","v":"SI_7"},{"$f":"'[1]311 SO-Schule'!EI1","v":"SI_8"},{"$f":"'[1]311 SO-Schule'!EJ1","v":"SI_9"},{"$f":"'[1]311 SO-Schule'!EK1","v":"Genehmiger"},{"$f":"'[1]311 SO-Schule'!EL1","v":"GN_Datum"},{"$f":"'[1]311 SO-Schule'!EM1","v":"GN_Status"},{"$f":"'[1]311 SO-Schule'!EN1","v":"UpdateDatum"},{"$f":"'[1]311 SO-Schule'!EO1","v":"SPF_lfdVerf"},{"$f":"'[1]311 SO-Schule'!EP1","v":"DF-Klasse int."},{"$f":"'[1]311 SO-Schule'!EQ1","v":"DF-Kurs"},{"$f":"'[1]311 SO-Schule'!ER1","v":"DF-BFD"},{"$f":"'[1]311 SO-Schule'!ES1","v":"DF-Kurs int."}]
[{"$f":"'[1]311 SO-Schule'!B2","v":"2021/22"},{"$f":"'[1]311 SO-Schule'!C2","v":"1"},{"$f":"'[1]311 SO-Schule'!D2","v":"3"},{"$f":"'[1]311 SO-Schule'!E2","v":501013},{"$f":"'[1]311 SO-Schule'!F2","v":"SO Salzburg"},{"$f":"'[1]311 SO-Schule'!G2","v":2},{"$f":"'[1]311 SO-Schule'!H2","v":"2021-10-01"},{"$f":"'[1]311 SO-Schule'!I2","v":3},{"$f":"'[1]311 SO-Schule'!J2","v":9},{"$f":"'[1]311 SO-Schule'!K2","v":0},{"$f":"'[1]311 SO-Schule'!L2","v":0},{"$f":"'[1]311 SO-Schule'!M2","v":5},{"$f":"'[1]311 SO-Schule'!N2","v":0},{"$f":"'[1]311 SO-Schule'!O2","v":0},{"$f":"'[1]311 SO-Schule'!P2","v":14},{"$f":"'[1]311 SO-Schule'!Q2","v":0},{"$f":"'[1]311 SO-Schule'!R2","v":0},{"$f":"'[1]311 SO-Schule'!S2","v":0},{"$f":"'[1]311 SO-Schule'!T2","v":0},{"$f":"'[1]311 SO-Schule'!U2","v":1},{"$f":"'[1]311 SO-Schule'!V2","v":1},{"$f":"'[1]311 SO-Schule'!W2","v":0},{"$f":"'[1]311 SO-Schule'!X2","v":1},{"$f":"'[1]311 SO-Schule'!Y2","v":1},{"$f":"'[1]311 SO-Schule'!Z2","v":1},{"$f":"'[1]311 SO-Schule'!AA2","v":8},{"$f":"'[1]311 SO-Schule'!AB2","v":8},{"$f":"'[1]311 SO-Schule'!AC2","v":0},{"$f":"'[1]311 SO-Schule'!AD2","v":5},{"$f":"'[1]311 SO-Schule'!AE2","v":5},{"$f":"'[1]311 SO-Schule'!AF2","v":1},{"$f":"'[1]311 SO-Schule'!AG2","v":11},{"$f":"'[1]311 SO-Schule'!AH2","v":11},{"$f":"'[1]311 SO-Schule'!AI2","v":1},{"$f":"'[1]311 SO-Schule'!AJ2","v":21},{"$f":"'[1]311 SO-Schule'!AK2","v":19},{"$f":"'[1]311 SO-Schule'!AL2","v":2},{"$f":"'[1]311 SO-Schule'!AM2","v":24},{"$f":"'[1]311 SO-Schule'!AN2","v":19},{"$f":"'[1]311 SO-Schule'!AO2","v":4},{"$f":"'[1]311 SO-Schule'!AP2","v":22},{"$f":"'[1]311 SO-Schule'!AQ2","v":19},{"$f":"'[1]311 SO-Schule'!AR2","v":5},{"$f":"'[1]311 SO-Schule'!AS2","v":42},{"$f":"'[1]311 SO-Schule'!AT2","v":42},{"$f":"'[1]311 SO-Schule'!AU2","v":90},{"$f":"'[1]311 SO-Schule'!AV2","v":0},{"$f":"'[1]311 SO-Schule'!AW2","v":0},{"$f":"'[1]311 SO-Schule'!AX2","v":33},{"$f":"'[1]311 SO-Schule'!AY2","v":18},{"$f":"'[1]311 SO-Schule'!AZ2","v":0},{"$f":"'[1]311 SO-Schule'!BA2","v":4},{"$f":"'[1]311 SO-Schule'!BB2","v":4},{"$f":"'[1]311 SO-Schule'!BC2","v":0},{"$f":"'[1]311 SO-Schule'!BD2","v":52},{"$f":"'[1]311 SO-Schule'!BE2","v":38},{"$f":"'[1]311 SO-Schule'!BF2","v":0},{"$f":"'[1]311 SO-Schule'!BG2","v":17},{"$f":"'[1]311 SO-Schule'!BH2","v":17},{"$f":"'[1]311 SO-Schule'!BI2","v":0},{"$f":"'[1]311 SO-Schule'!BJ2","v":0},{"$f":"'[1]311 SO-Schule'!BK2","v":0},{"$f":"'[1]311 SO-Schule'!BL2","v":0},{"$f":"'[1]311 SO-Schule'!BM2","v":14},{"$f":"'[1]311 SO-Schule'!BN2","v":0},{"$f":"'[1]311 SO-Schule'!BO2","v":0},{"$f":"'[1]311 SO-Schule'!BP2","v":0},{"$f":"'[1]311 SO-Schule'!BQ2","v":0},{"$f":"'[1]311 SO-Schule'!BR2","v":0},{"$f":"'[1]311 SO-Schule'!BS2","v":0},{"$f":"'[1]311 SO-Schule'!BT2","v":4},{"$f":"'[1]311 SO-Schule'!BU2","v":2},{"$f":"'[1]311 SO-Schule'!BV2","v":3},{"$f":"'[1]311 SO-Schule'!BW2","v":2},{"$f":"'[1]311 SO-Schule'!BX2","v":0},{"$f":"'[1]311 SO-Schule'!BY2","v":4},{"$f":"'[1]311 SO-Schule'!BZ2","v":7},{"$f":"'[1]311 SO-Schule'!CA2","v":12},{"$f":"'[1]311 SO-Schule'!CB2","v":24},{"$f":"'[1]311 SO-Schule'!CC2","v":0},{"$f":"'[1]311 SO-Schule'!CD2","v":0},{"$f":"'[1]311 SO-Schule'!CE2","v":0},{"$f":"'[1]311 SO-Schule'!CF2","v":3},{"$f":"'[1]311 SO-Schule'!CG2","v":5},{"$f":"'[1]311 SO-Schule'!CH2","v":7},{"$f":"'[1]311 SO-Schule'!CI2","v":15},{"$f":"'[1]311 SO-Schule'!CJ2","v":14},{"$f":"'[1]311 SO-Schule'!CK2","v":8},{"$f":"'[1]311 SO-Schule'!CL2","v":29},{"$f":"'[1]311 SO-Schule'!CM2","v":0},{"$f":"'[1]311 SO-Schule'!CN2","v":0},{"$f":"'[1]311 SO-Schule'!CO2","v":0},{"$f":"'[1]311 SO-Schule'!CP2","v":1},{"$f":"'[1]311 SO-Schule'!CQ2","v":0},{"$f":"'[1]311 SO-Schule'!CR2","v":1},{"$f":"'[1]311 SO-Schule'!CS2","v":2},{"$f":"'[1]311 SO-Schule'!CT2","v":2},{"$f":"'[1]311 SO-Schule'!CU2","v":5},{"$f":"'[1]311 SO-Schule'!CV2","v":0},{"$f":"'[1]311 SO-Schule'!CW2","v":0},{"$f":"'[1]311 SO-Schule'!CX2","v":0},{"$f":"'[1]311 SO-Schule'!CY2","v":1},{"$f":"'[1]311 SO-Schule'!CZ2","v":4},{"$f":"'[1]311 SO-Schule'!DA2","v":0},{"$f":"'[1]311 SO-Schule'!DB2","v":2},{"$f":"'[1]311 SO-Schule'!DC2","v":4},{"$f":"'[1]311 SO-Schule'!DD2","v":2},{"$f":"'[1]311 SO-Schule'!DE2","v":7},{"$f":"'[1]311 SO-Schule'!DF2","v":13},{"$f":"'[1]311 SO-Schule'!DG2","v":0},{"$f":"'[1]311 SO-Schule'!DH2","v":0},{"$f":"'[1]311 SO-Schule'!DI2","v":0},{"$f":"'[1]311 SO-Schule'!DJ2","v":0},{"$f":"'[1]311 SO-Schule'!DK2","v":0},{"$f":"'[1]311 SO-Schule'!DL2","v":0},{"$f":"'[1]311 SO-Schule'!DM2","v":0},{"$f":"'[1]311 SO-Schule'!DN2","v":0},{"$f":"'[1]311 SO-Schule'!DO2","v":0},{"$f":"'[1]311 SO-Schule'!DP2","v":0},{"$f":"'[1]311 SO-Schule'!DQ2","v":0},{"$f":"'[1]311 SO-Schule'!DR2","v":0},{"$f":"'[1]311 SO-Schule'!DS2","v":0},{"$f":"'[1]311 SO-Schule'!DT2","v":0},{"$f":"'[1]311 SO-Schule'!DU2","v":0},{"$f":"'[1]311 SO-Schule'!DV2","v":0},{"$f":"'[1]311 SO-Schule'!DW2","v":0},{"$f":"'[1]311 SO-Schule'!DX2","v":0},{"$f":"'[1]311 SO-Schule'!DY2","v":0},{"$f":"'[1]311 SO-Schule'!DZ2","v":0},{"$f":"'[1]311 SO-Schule'!EA2","v":0},{"$f":"'[1]311 SO-Schule'!EB2","v":1},{"$f":"'[1]311 SO-Schule'!EC2","v":0},{"$f":"'[1]311 SO-Schule'!ED2","v":0},{"$f":"'[1]311 SO-Schule'!EE2","v":0},{"$f":"'[1]311 SO-Schule'!EF2","v":0},{"$f":"'[1]311 SO-Schule'!EG2","v":0},{"$f":"'[1]311 SO-Schule'!EH2","v":0},{"$f":"'[1]311 SO-Schule'!EI2","v":0},{"$f":"'[1]311 SO-Schule'!EJ2","v":0},{"$f":"'[1]311 SO-Schule'!EK2","v":501013},{"$f":"'[1]311 SO-Schule'!EL2","v":44475},{"$f":"'[1]311 SO-Schule'!EM2","v":"genehmigt"},{"$f":"'[1]311 SO-Schule'!EN2","v":"2021-10-06"},{"$f":"'[1]311 SO-Schule'!EO2","v":2},{"$f":"'[1]311 SO-Schule'!EP2","v":0},{"$f":"'[1]311 SO-Schule'!EQ2","v":0},{"$f":"'[1]311 SO-Schule'!ER2","v":77},{"$f":"'[1]311 SO-Schule'!ES2","v":0}]

{"sheet":"STP2","index":2,"n_rows":26,"n_cols":150,"rows_kept":26,"cut":false,"hidden":false,"merged":[]}
[{"$f":"'[2]312 SO-Klassen'!B1","v":"Schuljahr"},{"$f":"'[2]312 SO-Klassen'!C1","v":"BezirkNr"},{"$f":"'[2]312 SO-Klassen'!D1","v":"Schultyp"},{"$f":"'[2]312 SO-Klassen'!E1","v":"SKZ"},{"$f":"'[2]312 SO-Klassen'!F1","v":"Schule"},{"$f":"'[2]312 SO-Klassen'!G1","v":"Status"},{"$f":"'[2]312 SO-Klassen'!H1","v":"Stichtag"},{"$f":"'[2]312 SO-Klassen'!I1","v":"Schulart"},{"$f":"'[2]312 SO-Klassen'!J1","v":"Schulstufe"},{"$f":"'[2]312 SO-Klassen'!K1","v":"Klasse"},{"$f":"'[2]312 SO-Klassen'!L1","v":"Kl_Art_ASO"},{"$f":"'[2]312 SO-Klassen'!M1","v":"Kl_Art_SE"},{"$f":"'[2]312 SO-Klassen'!N1","v":"Kl_Art_KB"},{"$f":"'[2]312 SO-Klassen'!O1","v":"Kl_Art_SB"},{"$f":"'[2]312 SO-Klassen'!P1","v":"Kl_Art_SI"},{"$f":"'[2]312 SO-Klassen'!Q1","v":"Kl_Art_MB"},{"$f":"'[2]312 SO-Klassen'!R1","v":"Kl_Anz"},{"$f":"'[2]312 SO-Klassen'!S1","v":"Kl0"},{"$f":"'[2]312 SO-Klassen'!T1","v":"Anz0"},{"$f":"'[2]312 SO-Klassen'!U1","v":"SPF0"},{"$f":"'[2]312 SO-Klassen'!V1","v":"Kl1"},{"$f":"'[2]312 SO-Klassen'!W1","v":"Anz1"},{"$f":"'[2]312 SO-Klassen'!X1","v":"SPF1"},{"$f":"'[2]312 SO-Klassen'!Y1","v":"Kl2"},{"$f":"'[2]312 SO-Klassen'!Z1","v":"Anz2"},{"$f":"'[2]312 SO-Klassen'!AA1","v":"SPF2"},{"$f":"'[2]312 SO-Klassen'!AB1","v":"Kl3"},{"$f":"'[2]312 SO-Klassen'!AC1","v":"Anz3"},{"$f":"'[2]312 SO-Klassen'!AD1","v":"SPF3"},{"$f":"'[2]312 SO-Klassen'!AE1","v":"Kl4"},{"$f":"'[2]312 SO-Klassen'!AF1","v":"Anz4"},{"$f":"'[2]312 SO-Klassen'!AG1","v":"SPF4"},{"$f":"'[2]312 SO-Klassen'!AH1","v":"Kl5"},{"$f":"'[2]312 SO-Klassen'!AI1","v":"Anz5"},{"$f":"'[2]312 SO-Klassen'!AJ1","v":"SPF5"},{"$f":"'[2]312 SO-Klassen'!AK1","v":"Kl6"},{"$f":"'[2]312 SO-Klassen'!AL1","v":"Anz6"},{"$f":"'[2]312 SO-Klassen'!AM1","v":"SPF6"},{"$f":"'[2]312 SO-Klassen'!AN1","v":"Kl7"},{"$f":"'[2]312 SO-Klassen'!AO1","v":"Anz7"},{"$f":"'[2]312 SO-Klassen'!AP1","v":"SPF7"},{"$f":"'[2]312 SO-Klassen'!AQ1","v":"Kl8"},{"$f":"'[2]312 SO-Klassen'!AR1","v":"Anz8"},{"$f":"'[2]312 SO-Klassen'!AS1","v":"SPF8"},{"$f":"'[2]312 SO-Klassen'!AT1","v":"Kl9"},{"$f":"'[2]312 SO-Klassen'!AU1","v":"Anz9"},{"$f":"'[2]312 SO-Klassen'!AV1","v":"SPF9"},{"$f":"'[2]312 SO-Klassen'!AW1","v":"NDSprache"},{"$f":"'[2]312 SO-Klassen'!AX1","v":"AO"},{"$f":"'[2]312 SO-Klassen'!AY1","v":"SprengelF"},{"$f":"'[2]312 SO-Klassen'!AZ1","v":"Rel_RK"},{"$f":"'[2]312 SO-Klassen'!BA1","v":"Rel_RK_Abmeld"},{"$f":"'[2]312 SO-Klassen'!BB1","v":"Rel_RK_FG"},{"$f":"'[2]312 SO-Klassen'!BC1","v":"Rel_EV"},{"$f":"'[2]312 SO-Klassen'!BD1","v":"Rel_EV_Abmeld"},{"$f":"'[2]312 SO-Klassen'!BE1","v":"Rel_EV_FG"},{"$f":"'[2]312 SO-Klassen'!BF1","v":"Rel_ISL"},{"$f":"'[2]312 SO-Klassen'!BG1","v":"Rel_ISL_Abmeld"},{"$f":"'[2]312 SO-Klassen'!BH1","v":"Rel_ISL_FG"},{"$f":"'[2]312 SO-Klassen'!BI1","v":"Rel_ORTH"},{"$f":"'[2]312 SO-Klassen'!BJ1","v":"Rel_ORTH_Abmeld"},{"$f":"'[2]312 SO-Klassen'!BK1","v":"Rel_ORTH_FG"},{"$f":"'[2]312 SO-Klassen'!BL1","v":"Rel_SONST"},{"$f":"'[2]312 SO-Klassen'!BM1","v":"Rel_SONST_Abmeld"},{"$f":"'[2]312 SO-Klassen'!BN1","v":"Rel_SONST_FG"},{"$f":"'[2]312 SO-Klassen'!BO1","v":"I_Klassen"},{"$f":"'[2]312 SO-Klassen'!BP1","v":"Anz_I1"},{"$f":"'[2]312 SO-Klassen'!BQ1","v":"Anz_I2"},{"$f":"'[2]312 SO-Klassen'!BR1","v":"Anz_I3"},{"$f":"'[2]312 SO-Klassen'!BS1","v":"Anz_I4"},{"$f":"'[2]312 SO-Klassen'!BT1","v":"Anz_I5"},{"$f":"'[2]312 SO-Klassen'!BU1","v":"Anz_I6"},{"$f":"'[2]312 SO-Klassen'!BV1","v":"Anz_I7"},{"$f":"'[2]312 SO-Klassen'!BW1","v":"Anz_I8"},{"$f":"'[2]312 SO-Klassen'!BX1","v":"Anz_I9"},{"$f":"'[2]312 SO-Klassen'!BY1","v":"Anz_I10"},{"$f":"'[2]312 SO-Klassen'!BZ1","v":"GTS_1Tag"},{"$f":"'[2]312 SO-Klassen'!CA1","v":"GTS_2Tage"},{"$f":"'[2]312 SO-Klassen'!CB1","v":"GTS_3Tage"},{"$f":"'[2]312 SO-Klassen'!CC1","v":"GTS_4Tage"},{"$f":"'[2]312 SO-Klassen'!CD1","v":"GTS_5Tage"},{"$f":"'[2]312 SO-Klassen'!CE1","v":"ASO_0"},{"$f":"'[2]312 SO-Klassen'!CF1","v":"ASO_1"},{"$f":"'[2]312 SO-Klassen'!CG1","v":"ASO_2"},{"$f":"'[2]312 SO-Klassen'!CH1","v":"ASO_3"},{"$f":"'[2]312 SO-Klassen'!CI1","v":"ASO_4"},{"$f":"'[2]312 SO-Klassen'!CJ1","v":"ASO_5"},{"$f":"'[2]312 SO-Klassen'!CK1","v":"ASO_6"},{"$f":"'[2]312 SO-Klassen'!CL1","v":"ASO_7"},{"$f":"'[2]312 SO-Klassen'!CM1","v":"ASO_8"},{"$f":"'[2]312 SO-Klassen'!CN1","v":"ASO_9"},{"$f":"'[2]312 SO-Klassen'!CO1","v":"SE_0"},{"$f":"'[2]312 SO-Klassen'!CP1","v":"SE_1"},{"$f":"'[2]312 SO-Klassen'!CQ1","v":"SE_2"},{"$f":"'[2]312 SO-Klassen'!CR1","v":"SE_3"},{"$f":"'[2]312 SO-Klassen'!CS1","v":"SE_4"},{"$f":"'[2]312 SO-Klassen'!CT1","v":"SE_5"},{"$f":"'[2]312 SO-Klassen'!CU1","v":"SE_6"},{"$f":"'[2]312 SO-Klassen'!CV1","v":"SE_7"},{"$f":"'[2]312 SO-Klassen'!CW1","v":"SE_8"},{"$f":"'[2]312 SO-Klassen'!CX1","v":"SE_9"},{"$f":"'[2]312 SO-Klassen'!CY1","v":"SB_0"},{"$f":"'[2]312 SO-Klassen'!CZ1","v":"SB_1"},{"$f":"'[2]312 SO-Klassen'!DA1","v":"SB_2"},{"$f":"'[2]312 SO-Klassen'!DB1","v":"SB_3"},{"$f":"'[2]312 SO-Klassen'!DC1","v":"SB_4"},{"$f":"'[2]312 SO-Klassen'!DD1","v":"SB_5"},{"$f":"'[2]312 SO-Klassen'!DE1","v":"SB_6"},{"$f":"'[2]312 SO-Klassen'!DF1","v":"SB_7"},{"$f":"'[2]312 SO-Klassen'!DG1","v":"SB_8"},{"$f":"'[2]312 SO-Klassen'!DH1","v":"SB_9"},{"$f":"'[2]312 SO-Klassen'!DI1","v":"KB_0"},{"$f":"'[2]312 SO-Klassen'!DJ1","v":"KB_1"},{"$f":"'[2]312 SO-Klassen'!DK1","v":"KB_2"},{"$f":"'[2]312 SO-Klassen'!DL1","v":"KB_3"},{"$f":"'[2]312 SO-Klassen'!DM1","v":"KB_4"},{"$f":"'[2]312 SO-Klassen'!DN1","v":"KB_5"},{"$f":"'[2]312 SO-Klassen'!DO1","v":"KB_6"},{"$f":"'[2]312 SO-Klassen'!DP1","v":"KB_7"},{"$f":"'[2]312 SO-Klassen'!DQ1","v":"KB_8"},{"$f":"'[2]312 SO-Klassen'!DR1","v":"KB_9"},{"$f":"'[2]312 SO-Klassen'!DS1","v":"MB_0"},{"$f":"'[2]312 SO-Klassen'!DT1","v":"MB_1"},{"$f":"'[2]312 SO-Klassen'!DU1","v":"MB_2"},{"$f":"'[2]312 SO-Klassen'!DV1","v":"MB_3"},{"$f":"'[2]312 SO-Klassen'!DW1","v":"MB_4"},{"$f":"'[2]312 SO-Klassen'!DX1","v":"MB_5"},{"$f":"'[2]312 SO-Klassen'!DY1","v":"MB_6"},{"$f":"'[2]312 SO-Klassen'!DZ1","v":"MB_7"},{"$f":"'[2]312 SO-Klassen'!EA1","v":"MB_8"},{"$f":"'[2]312 SO-Klassen'!EB1","v":"MB_9"},{"$f":"'[2]312 SO-Klassen'!EC1","v":"SI_0"},{"$f":"'[2]312 SO-Klassen'!ED1","v":"SI_1"},{"$f":"'[2]312 SO-Klassen'!EE1","v":"SI_2"},{"$f":"'[2]312 SO-Klassen'!EF1","v":"SI_3"},{"$f":"'[2]312 SO-Klassen'!EG1","v":"SI_4"},{"$f":"'[2]312 SO-Klassen'!EH1","v":"SI_5"},{"$f":"'[2]312 SO-Klassen'!EI1","v":"SI_6"},{"$f":"'[2]312 SO-Klassen'!EJ1","v":"SI_7"},{"$f":"'[2]312 SO-Klassen'!EK1","v":"SI_8"},{"$f":"'[2]312 SO-Klassen'!EL1","v":"SI_9"},{"$f":"'[2]312 SO-Klassen'!EM1","v":"Genehmiger"},{"$f":"'[2]312 SO-Klassen'!EN1","v":"GN_Datum"},{"$f":"'[2]312 SO-Klassen'!EO1","v":"GN_Status"},{"$f":"'[2]312 SO-Klassen'!EP1","v":"UpdateDatum"},{"$f":"'[2]312 SO-Klassen'!EQ1","v":"SPF_lfdVerf"},{"$f":"'[2]312 SO-Klassen'!ER1","v":"DF-Klasse int."},{"$f":"'[2]312 SO-Klassen'!ES1","v":"DF-Kurs"},{"$f":"'[2]312 SO-Klassen'!ET1","v":"DF-BFD"},{"$f":"'[2]312 SO-Klassen'!EU1","v":"DF-Kurs int."}]
[{"$f":"'[2]312 SO-Klassen'!B2","v":"2021/22"},{"$f":"'[2]312 SO-Klassen'!C2","v":"1"},{"$f":"'[2]312 SO-Klassen'!D2","v":"3"},{"$f":"'[2]312 SO-Klassen'!E2","v":501013},{"$f":"'[2]312 SO-Klassen'!F2","v":"SO Salzburg"},{"$f":"'[2]312 SO-Klassen'!G2","v":2},{"$f":"'[2]312 SO-Klassen'!H2","v":"2021-10-01"},{"$f":"'[2]312 SO-Klassen'!I2","v":3},{"$f":"'[2]312 SO-Klassen'!J2","v":"03"},{"$f":"'[2]312 SO-Klassen'!K2","v":"1GUS"},{"$f":"'[2]312 SO-Klassen'!L2","v":0},{"$f":"'[2]312 SO-Klassen'!M2","v":0},{"$f":"'[2]312 SO-Klassen'!N2","v":0},{"$f":"'[2]312 SO-Klassen'!O2","v":1},{"$f":"'[2]312 SO-Klassen'!P2","v":0},{"$f":"'[2]312 SO-Klassen'!Q2","v":0},{"$f":"'[2]312 SO-Klassen'!R2","v":1},{"$f":"'[2]312 SO-Klassen'!S2","v":0},{"$f":"'[2]312 SO-Klassen'!T2","v":0},{"$f":"'[2]312 SO-Klassen'!U2","v":0},{"$f":"'[2]312 SO-Klassen'!V2","v":0},{"$f":"'[2]312 SO-Klassen'!W2","v":1},{"$f":"'[2]312 SO-Klassen'!X2","v":1},{"$f":"'[2]312 SO-Klassen'!Y2","v":0},{"$f":"'[2]312 SO-Klassen'!Z2","v":1},{"$f":"'[2]312 SO-Klassen'!AA2","v":1},{"$f":"'[2]312 SO-Klassen'!AB2","v":1},{"$f":"'[2]312 SO-Klassen'!AC2","v":4},{"$f":"'[2]312 SO-Klassen'!AD2","v":4},{"$f":"'[2]312 SO-Klassen'!AE2","v":0},{"$f":"'[2]312 SO-Klassen'!AF2","v":1},{"$f":"'[2]312 SO-Klassen'!AG2","v":1},{"$f":"'[2]312 SO-Klassen'!AH2","v":0},{"$f":"'[2]312 SO-Klassen'!AI2","v":0},{"$f":"'[2]312 SO-Klassen'!AJ2","v":0},{"$f":"'[2]312 SO-Klassen'!AK2","v":0},{"$f":"'[2]312 SO-Klassen'!AL2","v":0},{"$f":"'[2]312 SO-Klassen'!AM2","v":0},{"$f":"'[2]312 SO-Klassen'!AN2","v":0},{"$f":"'[2]312 SO-Klassen'!AO2","v":0},{"$f":"'[2]312 SO-Klassen'!AP2","v":0},{"$f":"'[2]312 SO-Klassen'!AQ2","v":0},{"$f":"'[2]312 SO-Klassen'!AR2","v":0},{"$f":"'[2]312 SO-Klassen'!AS2","v":0},{"$f":"'[2]312 SO-Klassen'!AT2","v":0},{"$f":"'[2]312 SO-Klassen'!AU2","v":0},{"$f":"'[2]312 SO-Klassen'!AV2","v":0},{"$f":"'[2]312 SO-Klassen'!AW2","v":5},{"$f":"'[2]312 SO-Klassen'!AX2","v":0},{"$f":"'[2]312 SO-Klassen'!AY2","v":0},{"$f":"'[2]312 SO-Klassen'!AZ2","v":1},{"$f":"'[2]312 SO-Klassen'!BA2","v":1},{"$f":"'[2]312 SO-Klassen'!BB2","v":0},{"$f":"'[2]312 SO-Klassen'!BC2","v":0},{"$f":"'[2]312 SO-Klassen'!BD2","v":0},{"$f":"'[2]312 SO-Klassen'!BE2","v":0},{"$f":"'[2]312 SO-Klassen'!BF2","v":2},{"$f":"'[2]312 SO-Klassen'!BG2","v":2},{"$f":"'[2]312 SO-Klassen'!BH2","v":0},{"$f":"'[2]312 SO-Klassen'!BI2","v":1},{"$f":"'[2]312 SO-Klassen'!BJ2","v":1},{"$f":"'[2]312 SO-Klassen'!BK2","v":0},{"$f":"'[2]312 SO-Klassen'!BL2","v":0},{"$f":"'[2]312 SO-Klassen'!BM2","v":0},{"$f":"'[2]312 SO-Klassen'!BN2","v":0},{"$f":"'[2]312 SO-Klassen'!BO2","v":1},{"$f":"'[2]312 SO-Klassen'!BP2","v":0},{"$f":"'[2]312 SO-Klassen'!BQ2","v":0},{"$f":"'[2]312 SO-Klassen'!BR2","v":0},{"$f":"'[2]312 SO-Klassen'!BS2","v":0},{"$f":"'[2]312 SO-Klassen'!BT2","v":0},{"$f":"'[2]312 SO-Klassen'!BU2","v":0},{"$f":"'[2]312 SO-Klassen'!BV2","v":1},{"$f":"'[2]312 SO-Klassen'!BW2","v":0},{"$f":"'[2]312 SO-Klassen'!BX2","v":0},{"$f":"'[2]312 SO-Klassen'!BY2","v":0},{"$f":"'[2]312 SO-Klassen'!BZ2","v":0},{"$f":"'[2]312 SO-Klassen'!CA2","v":0},{"$f":"'[2]312 SO-Klassen'!CB2","v":0},{"$f":"'[2]312 SO-Klassen'!CC2","v":0},{"$f":"'[2]312 SO-Klassen'!CD2","v":4},{"$f":"'[2]312 SO-Klassen'!CE2","v":0},{"$f":"'[2]312 SO-Klassen'!CF2","v":0},{"$f":"'[2]312 SO-Klassen'!CG2","v":0},{"$f":"'[2]312 SO-Klassen'!CH2","v":0},{"$f":"'[2]312 SO-Klassen'!CI2","v":1},{"$f":"'[2]312 SO-Klassen'!CJ2","v":0},{"$f":"'[2]312 SO-Klassen'!CK2","v":0},{"$f":"'[2]312 SO-Klassen'!CL2","v":0},{"$f":"'[2]312 SO-Klassen'!CM2","v":0},{"$f":"'[2]312 SO-Klassen'!CN2","v":0},{"$f":"'[2]312 SO-Klassen'!CO2","v":0},{"$f":"'[2]312 SO-Klassen'!CP2","v":0},{"$f":"'[2]312 SO-Klassen'!CQ2","v":0},{"$f":"'[2]312 SO-Klassen'!CR2","v":1},{"$f":"'[2]312 SO-Klassen'!CS2","v":0},{"$f":"'[2]312 SO-Klassen'!CT2","v":0},{"$f":"'[2]312 SO-Klassen'!CU2","v":0},{"$f":"'[2]312 SO-Klassen'!CV2","v":0},{"$f":"'[2]312 SO-Klassen'!CW2","v":0},{"$f":"'[2]312 SO-Klassen'!CX2","v":0},{"$f":"'[2]312 SO-Klassen'!CY2","v":0},{"$f":"'[2]312 SO-Klassen'!CZ2","v":0},{"$f":"'[2]312 SO-Klassen'!DA2","v":1},{"$f":"'[2]312 SO-Klassen'!DB2","v":3},{"$f":"'[2]312 SO-Klassen'!DC2","v":0},{"$f":"'[2]312 SO-Klassen'!DD2","v":0},{"$f":"'[2]312 SO-Klassen'!DE2","v":0},{"$f":"'[2]312 SO-Klassen'!DF2","v":0},{"$f":"'[2]312 SO-Klassen'!DG2","v":0},{"$f":"'[2]312 SO-Klassen'!DH2","v":0},{"$f":"'[2]312 SO-Klassen'!DI2","v":0},{"$f":"'[2]312 SO-Klassen'!DJ2","v":0},{"$f":"'[2]312 SO-Klassen'!DK2","v":0},{"$f":"'[2]312 SO-Klassen'!DL2","v":0},{"$f":"'[2]312 SO-Klassen'!DM2","v":0},{"$f":"'[2]312 SO-Klassen'!DN2","v":0},{"$f":"'[2]312 SO-Klassen'!DO2","v":0},{"$f":"'[2]312 SO-Klassen'!DP2","v":0},{"$f":"'[2]312 SO-Klassen'!DQ2","v":0},{"$f":"'[2]312 SO-Klassen'!DR2","v":0},{"$f":"'[2]312 SO-Klassen'!DS2","v":0},{"$f":"'[2]312 SO-Klassen'!DT2","v":0},{"$f":"'[2]312 SO-Klassen'!DU2","v":0},{"$f":"'[2]312 SO-Klassen'!DV2","v":0},{"$f":"'[2]312 SO-Klassen'!DW2","v":0},{"$f":"'[2]312 SO-Klassen'!DX2","v":0},{"$f":"'[2]312 SO-Klassen'!DY2","v":0},{"$f":"'[2]312 SO-Klassen'!DZ2","v":0},{"$f":"'[2]312 SO-Klassen'!EA2","v":0},{"$f":"'[2]312 SO-Klassen'!EB2","v":0},{"$f":"'[2]312 SO-Klassen'!EC2","v":0},{"$f":"'[2]312 SO-Klassen'!ED2","v":1},{"$f":"'[2]312 SO-Klassen'!EE2","v":0},{"$f":"'[2]312 SO-Klassen'!EF2","v":0},{"$f":"'[2]312 SO-Klassen'!EG2","v":0},{"$f":"'[2]312 SO-Klassen'!EH2","v":0},{"$f":"'[2]312 SO-Klassen'!EI2","v":0},{"$f":"'[2]312 SO-Klassen'!EJ2","v":0},{"$f":"'[2]312 SO-Klassen'!EK2","v":0},{"$f":"'[2]312 SO-Klassen'!EL2","v":0},{"$f":"'[2]312 SO-Klassen'!EM2","v":501013},{"$f":"'[2]312 SO-Klassen'!EN2","v":44475},{"$f":"'[2]312 SO-Klassen'!EO2","v":"genehmigt"},{"$f":"'[2]312 SO-Klassen'!EP2","v":"2021-10-06"},{"$f":"'[2]312 SO-Klassen'!EQ2","v":0},{"$f":"'[2]312 SO-Klassen'!ER2","v":0},{"$f":"'[2]312 SO-Klassen'!ES2","v":0},{"$f":"'[2]312 SO-Klassen'!ET2","v":3},{"$f":"'[2]312 SO-Klassen'!EU2","v":0}]
[{"$f":"'[2]312 SO-Klassen'!B3","v":"2021/22"},{"$f":"'[2]312 SO-Klassen'!C3","v":"1"},{"$f":"'[2]312 SO-Klassen'!D3","v":"3"},{"$f":"'[2]312 SO-Klassen'!E3","v":501013},{"$f":"'[2]312 SO-Klassen'!F3","v":"SO Salzburg"},{"$f":"'[2]312 SO-Klassen'!G3","v":2},{"$f":"'[2]312 SO-Klassen'!H3","v":"2021-10-01"},{"$f":"'[2]312 SO-Klassen'!I3","v":3},{"$f":"'[2]312 SO-Klassen'!J3","v":"05"},{"$f":"'[2]312 SO-Klassen'!K3","v":"1aFö"},{"$f":"'[2]312 SO-Klassen'!L3","v":1},{"$f":"'[2]312 SO-Klassen'!M3","v":0},{"$f":"'[2]312 SO-Klassen'!N3","v":0},{"$f":"'[2]312 SO-Klassen'!O3","v":0},{"$f":"'[2]312 SO-Klassen'!P3","v":0},{"$f":"'[2]312 SO-Klassen'!Q3","v":0},{"$f":"'[2]312 SO-Klassen'!R3","v":1},{"$f":"'[2]312 SO-Klassen'!S3","v":0},{"$f":"'[2]312 SO-Klassen'!T3","v":0},{"$f":"'[2]312 SO-Klassen'!U3","v":0},{"$f":"'[2]312 SO-Klassen'!V3","v":0},{"$f":"'[2]312 SO-Klassen'!W3","v":0},{"$f":"'[2]312 SO-Klassen'!X3","v":0},{"$f":"'[2]312 SO-Klassen'!Y3","v":0},{"$f":"'[2]312 SO-Klassen'!Z3","v":0},{"$f":"'[2]312 SO-Klassen'!AA3","v":0},{"$f":"'[2]312 SO-Klassen'!AB3","v":0},{"$f":"'[2]312 SO-Klassen'!AC3","v":0},{"$f":"'[2]312 SO-Klassen'!AD3","v":0},{"$f":"'[2]312 SO-Klassen'!AE3","v":0},{"$f":"'[2]312 SO-Klassen'!AF3","v":0},{"$f":"'[2]312 SO-Klassen'!AG3","v":0},{"$f":"'[2]312 SO-Klassen'!AH3","v":1},{"$f":"'[2]312 SO-Klassen'!AI3","v":9},{"$f":"'[2]312 SO-Klassen'!AJ3","v":9},{"$f":"'[2]312 SO-Klassen'!AK3","v":0},{"$f":"'[2]312 SO-Klassen'!AL3","v":0},{"$f":"'[2]312 SO-Klassen'!AM3","v":0},{"$f":"'[2]312 SO-Klassen'!AN3","v":0},{"$f":"'[2]312 SO-Klassen'!AO3","v":0},{"$f":"'[2]312 SO-Klassen'!AP3","v":0},{"$f":"'[2]312 SO-Klassen'!AQ3","v":0},{"$f":"'[2]312 SO-Klassen'!AR3","v":0},{"$f":"'[2]312 SO-Klassen'!AS3","v":0},{"$f":"'[2]312 SO-Klassen'!AT3","v":0},{"$f":"'[2]312 SO-Klassen'!AU3","v":0},{"$f":"'[2]312 SO-Klassen'!AV3","v":0},{"$f":"'[2]312 SO-Klassen'!AW3","v":5},{"$f":"'[2]312 SO-Klassen'!AX3","v":0},{"$f":"'[2]312 SO-Klassen'!AY3","v":0},{"$f":"'[2]312 SO-Klassen'!AZ3","v":6},{"$f":"'[2]312 SO-Klassen'!BA3","v":1},{"$f":"'[2]312 SO-Klassen'!BB3","v":0},{"$f":"'[2]312 SO-Klassen'!BC3","v":0},{"$f":"'[2]312 SO-Klassen'!BD3","v":0},{"$f":"'[2]312 SO-Klassen'!BE3","v":0},{"$f":"'[2]312 SO-Klassen'!BF3","v":2},{"$f":"'[2]312 SO-Klassen'!BG3","v":1},{"$f":"'[2]312 SO-Klassen'!BH3","v":0},{"$f":"'[2]312 SO-Klassen'!BI3","v":1},{"$f":"'[2]312 SO-Klassen'!BJ3","v":1},{"$f":"'[2]312 SO-Klassen'!BK3","v":0},{"$f":"'[2]312 SO-Klassen'!BL3","v":0},{"$f":"'[2]312 SO-Klassen'!BM3","v":0},{"$f":"'[2]312 SO-Klassen'!BN3","v":0},{"$f":"'[2]312 SO-Klassen'!BO3","v":1},{"$f":"'[2]312 SO-Klassen'!BP3","v":0},{"$f":"'[2]312 SO-Klassen'!BQ3","v":0},{"$f":"'[2]312 SO-Klassen'!BR3","v":0},{"$f":"'[2]312 SO-Klassen'!BS3","v":0},{"$f":"'[2]312 SO-Klassen'!BT3","v":0},{"$f":"'[2]312 SO-Klassen'!BU3","v":0},{"$f":"'[2]312 SO-Klassen'!BV3","v":0},{"$f":"'[2]312 SO-Klassen'!BW3","v":0},{"$f":"'[2]312 SO-Klassen'!BX3","v":1},{"$f":"'[2]312 SO-Klassen'!BY3","v":0},{"$f":"'[2]312 SO-Klassen'!BZ3","v":0},{"$f":"'[2]312 SO-Klassen'!CA3","v":1},{"$f":"'[2]312 SO-Klassen'!CB3","v":1},{"$f":"'[2]312 SO-Klassen'!CC3","v":0},{"$f":"'[2]312 SO-Klassen'!CD3","v":2},{"$f":"'[2]312 SO-Klassen'!CE3","v":0},{"$f":"'[2]312 SO-Klassen'!CF3","v":0},{"$f":"'[2]312 SO-Klassen'!CG3","v":0},{"$f":"'[2]312 SO-Klassen'!CH3","v":0},{"$f":"'[2]312 SO-Klassen'!CI3","v":0},{"$f":"'[2]312 SO-Klassen'!CJ3","v":5},{"$f":"'[2]312 SO-Klassen'!CK3","v":0},{"$f":"'[2]312 SO-Klassen'!CL3","v":0},{"$f":"'[2]312 SO-Klassen'!CM3","v":0},{"$f":"'[2]312 SO-Klassen'!CN3","v":0},{"$f":"'[2]312 SO-Klassen'!CO3","v":0},{"$f":"'[2]312 SO-Klassen'!CP3","v":0},{"$f":"'[2]312 SO-Klassen'!CQ3","v":0},{"$f":"'[2]312 SO-Klassen'!CR3","v":0},{"$f":"'[2]312 SO-Klassen'!CS3","v":0},{"$f":"'[2]312 SO-Klassen'!CT3","v":1},{"$f":"'[2]312 SO-Klassen'!CU3","v":0},{"$f":"'[2]312 SO-Klassen'!CV3","v":0},{"$f":"'[2]312 SO-Klassen'!CW3","v":0},{"$f":"'[2]312 SO-Klassen'!CX3","v":0},{"$f":"'[2]312 SO-Klassen'!CY3","v":0},{"$f":"'[2]312 SO-Klassen'!CZ3","v":0},{"$f":"'[2]312 SO-Klassen'!DA3","v":0},{"$f":"'[2]312 SO-Klassen'!DB3","v":0},{"$f":"'[2]312 SO-Klassen'!DC3","v":0},{"$f":"'[2]312 SO-Klassen'!DD3","v":2},{"$f":"'[2]312 SO-Klassen'!DE3","v":0},{"$f":"'[2]312 SO-Klassen'!DF3","v":0},{"$f":"'[2]312 SO-Klassen'!DG3","v":0},{"$f":"'[2]312 SO-Klassen'!DH3","v":0},{"$f":"'[2]312 SO-Klassen'!DI3","v":0},{"$f":"'[2]312 SO-Klassen'!DJ3","v":0},{"$f":"'[2]312 SO-Klassen'!DK3","v":0},{"$f":"'[2]312 SO-Klassen'!DL3","v":0},{"$f":"'[2]312 SO-Klassen'!DM3","v":0},{"$f":"'[2]312 SO-Klassen'!DN3","v":0},{"$f":"'[2]312 SO-Klassen'!DO3","v":0},{"$f":"'[2]312 SO-Klassen'!DP3","v":0},{"$f":"'[2]312 SO-Klassen'!DQ3","v":0},{"$f":"'[2]312 SO-Klassen'!DR3","v":0},{"$f":"'[2]312 SO-Klassen'!DS3","v":0},{"$f":"'[2]312 SO-Klassen'!DT3","v":0},{"$f":"'[2]312 SO-Klassen'!DU3","v":0},{"$f":"'[2]312 SO-Klassen'!DV3","v":0},{"$f":"'[2]312 SO-Klassen'!DW3","v":0},{"$f":"'[2]312 SO-Klassen'!DX3","v":0},{"$f":"'[2]312 SO-Klassen'!DY3","v":0},{"$f":"'[2]312 SO-Klassen'!DZ3","v":0},{"$f":"'[2]312 SO-Klassen'!EA3","v":0},{"$f":"'[2]312 SO-Klassen'!EB3","v":0},{"$f":"'[2]312 SO-Klassen'!EC3","v":0},{"$f":"'[2]312 SO-Klassen'!ED3","v":0},{"$f":"'[2]312 SO-Klassen'!EE3","v":0},{"$f":"'[2]312 SO-Klassen'!EF3","v":0},{"$f":"'[2]312 SO-Klassen'!EG3","v":0},{"$f":"'[2]312 SO-Klassen'!EH3","v":0},{"$f":"'[2]312 SO-Klassen'!EI3","v":0},{"$f":"'[2]312 SO-Klassen'!EJ3","v":0},{"$f":"'[2]312 SO-Klassen'!EK3","v":0},{"$f":"'[2]312 SO-Klassen'!EL3","v":0},{"$f":"'[2]312 SO-Klassen'!EM3","v":501013},{"$f":"'[2]312 SO-Klassen'!EN3","v":44475},{"$f":"'[2]312 SO-Klassen'!EO3","v":"genehmigt"},{"$f":"'[2]312 SO-Klassen'!EP3","v":"2021-10-06"},{"$f":"'[2]312 SO-Klassen'!EQ3","v":0},{"$f":"'[2]312 SO-Klassen'!ER3","v":0},{"$f":"'[2]312 SO-Klassen'!ES3","v":0},{"$f":"'[2]312 SO-Klassen'!ET3","v":5},{"$f":"'[2]312 SO-Klassen'!EU3","v":0}]
[{"$f":"'[2]312 SO-Klassen'!B4","v":"2021/22"},{"$f":"'[2]312 SO-Klassen'!C4","v":"1"},{"$f":"'[2]312 SO-Klassen'!D4","v":"3"},{"$f":"'[2]312 SO-Klassen'!E4","v":501013},{"$f":"'[2]312 SO-Klassen'!F4","v":"SO Salzburg"},{"$f":"'[2]312 SO-Klassen'!G4","v":2},{"$f":"'[2]312 SO-Klassen'!H4","v":"2021-10-01"},{"$f":"'[2]312 SO-Klassen'!I4","v":3},{"$f":"'[2]312 SO-Klassen'!J4","v":"06"},{"$f":"'[2]312 SO-Klassen'!K4","v":"2aFö"},{"$f":"'[2]312 SO-Klassen'!L4","v":1},{"$f":"'[2]312 SO-Klassen'!M4","v":0},{"$f":"'[2]312 SO-Klassen'!N4","v":0},{"$f":"'[2]312 SO-Klassen'!O4","v":0},{"$f":"'[2]312 SO-Klassen'!P4","v":0},{"$f":"'[2]312 SO-Klassen'!Q4","v":0},{"$f":"'[2]312 SO-Klassen'!R4","v":1},{"$f":"'[2]312 SO-Klassen'!S4","v":0},{"$f":"'[2]312 SO-Klassen'!T4","v":0},{"$f":"'[2]312 SO-Klassen'!U4","v":0},{"$f":"'[2]312 SO-Klassen'!V4","v":0},{"$f":"'[2]312 SO-Klassen'!W4","v":0},{"$f":"'[2]312 SO-Klassen'!X4","v":0},{"$f":"'[2]312 SO-Klassen'!Y4","v":0},{"$f":"'[2]312 SO-Klassen'!Z4","v":0},{"$f":"'[2]312 SO-Klassen'!AA4","v":0},{"$f":"'[2]312 SO-Klassen'!AB4","v":0},{"$f":"'[2]312 SO-Klassen'!AC4","v":0},{"$f":"'[2]312 SO-Klassen'!AD4","v":0},{"$f":"'[2]312 SO-Klassen'!AE4","v":0},{"$f":"'[2]312 SO-Klassen'!AF4","v":0},{"$f":"'[2]312 SO-Klassen'!AG4","v":0},{"$f":"'[2]312 SO-Klassen'!AH4","v":0},{"$f":"'[2]312 SO-Klassen'!AI4","v":0},{"$f":"'[2]312 SO-Klassen'!AJ4","v":0},{"$f":"'[2]312 SO-Klassen'!AK4","v":1},{"$f":"'[2]312 SO-Klassen'!AL4","v":9},{"$f":"'[2]312 SO-Klassen'!AM4","v":7},{"$f":"'[2]312 SO-Klassen'!AN4","v":0},{"$f":"'[2]312 SO-Klassen'!AO4","v":0},{"$f":"'[2]312 SO-Klassen'!AP4","v":0},{"$f":"'[2]312 SO-Klassen'!AQ4","v":0},{"$f":"'[2]312 SO-Klassen'!AR4","v":0},{"$f":"'[2]312 SO-Klassen'!AS4","v":0},{"$f":"'[2]312 SO-Klassen'!AT4","v":0},{"$f":"'[2]312 SO-Klassen'!AU4","v":0},{"$f":"'[2]312 SO-Klassen'!AV4","v":0},{"$f":"'[2]312 SO-Klassen'!AW4","v":3},{"$f":"'[2]312 SO-Klassen'!AX4","v":0},{"$f":"'[2]312 SO-Klassen'!AY4","v":0},{"$f":"'[2]312 SO-Klassen'!AZ4","v":3},{"$f":"'[2]312 SO-Klassen'!BA4","v":2},{"$f":"'[2]312 SO-Klassen'!BB4","v":0},{"$f":"'[2]312 SO-Klassen'!BC4","v":1},{"$f":"'[2]312 SO-Klassen'!BD4","v":1},{"$f":"'[2]312 SO-Klassen'!BE4","v":0},{"$f":"'[2]312 SO-Klassen'!BF4","v":0},{"$f":"'[2]312 SO-Klassen'!BG4","v":0},{"$f":"'[2]312 SO-Klassen'!BH4","v":0},{"$f":"'[2]312 SO-Klassen'!BI4","v":2},{"$f":"'[2]312 SO-Klassen'!BJ4","v":2},{"$f":"'[2]312 SO-Klassen'!BK4","v":0},{"$f":"'[2]312 SO-Klassen'!BL4","v":0},{"$f":"'[2]312 SO-Klassen'!BM4","v":0},{"$f":"'[2]312 SO-Klassen'!BN4","v":0},{"$f":"'[2]312 SO-Klassen'!BO4","v":1},{"$f":"'[2]312 SO-Klassen'!BP4","v":0},{"$f":"'[2]312 SO-Klassen'!BQ4","v":0},{"$f":"'[2]312 SO-Klassen'!BR4","v":0},{"$f":"'[2]312 SO-Klassen'!BS4","v":0},{"$f":"'[2]312 SO-Klassen'!BT4","v":0},{"$f":"'[2]312 SO-Klassen'!BU4","v":0},{"$f":"'[2]312 SO-Klassen'!BV4","v":1},{"$f":"'[2]312 SO-Klassen'!BW4","v":0},{"$f":"'[2]312 SO-Klassen'!BX4","v":0},{"$f":"'[2]312 SO-Klassen'!BY4","v":0},{"$f":"'[2]312 SO-Klassen'!BZ4","v":0},{"$f":"'[2]312 SO-Klassen'!CA4","v":0},{"$f":"'[2]312 SO-Klassen'!CB4","v":0},{"$f":"'[2]312 SO-Klassen'!CC4","v":2},{"$f":"'[2]312 SO-Klassen'!CD4","v":3},{"$f":"'[2]312 SO-Klassen'!CE4","v":0},{"$f":"'[2]312 SO-Klassen'!CF4","v":0},{"$f":"'[2]312 SO-Klassen'!CG4","v":0},{"$f":"'[2]312 SO-Klassen'!CH4","v":0},{"$f":"'[2]312 SO-Klassen'!CI4","v":0},{"$f":"'[2]312 SO-Klassen'!CJ4","v":0},{"$f":"'[2]312 SO-Klassen'!CK4","v":8},{"$f":"'[2]312 SO-Klassen'!CL4","v":0},{"$f":"'[2]312 SO-Klassen'!CM4","v":0},{"$f":"'[2]312 SO-Klassen'!CN4","v":0},{"$f":"'[2]312 SO-Klassen'!CO4","v":0},{"$f":"'[2]312 SO-Klassen'!CP4","v":0},{"$f":"'[2]312 SO-Klassen'!CQ4","v":0},{"$f":"'[2]312 SO-Klassen'!CR4","v":0},{"$f":"'[2]312 SO-Klassen'!CS4","v":0},{"$f":"'[2]312 SO-Klassen'!CT4","v":0},{"$f":"'[2]312 SO-Klassen'!CU4","v":1},{"$f":"'[2]312 SO-Klassen'!CV4","v":0},{"$f":"'[2]312 SO-Klassen'!CW4","v":0},{"$f":"'[2]312 SO-Klassen'!CX4","v":0},{"$f":"'[2]312 SO-Klassen'!CY4","v":0},{"$f":"'[2]312 SO-Klassen'!CZ4","v":0},{"$f":"'[2]312 SO-Klassen'!DA4","v":0},{"$f":"'[2]312 SO-Klassen'!DB4","v":0},{"$f":"'[2]312 SO-Klassen'!DC4","v":0},{"$f":"'[2]312 SO-Klassen'!DD4","v":0},{"$f":"'[2]312 SO-Klassen'!DE4","v":0},{"$f":"'[2]312 SO-Klassen'!DF4","v":0},{"$f":"'[2]312 SO-Klassen'!DG4","v":0},{"$f":"'[2]312 SO-Klassen'!DH4","v":0},{"$f":"'[2]312 SO-Klassen'!DI4","v":0},{"$f":"'[2]312 SO-Klassen'!DJ4","v":0},{"$f":"'[2]312 SO-Klassen'!DK4","v":0},{"$f":"'[2]312 SO-Klassen'!DL4","v":0},{"$f":"'[2]312 SO-Klassen'!DM4","v":0},{"$f":"'[2]312 SO-Klassen'!DN4","v":0},{"$f":"'[2]312 SO-Klassen'!DO4","v":0},{"$f":"'[2]312 SO-Klassen'!DP4","v":0},{"$f":"'[2]312 SO-Klassen'!DQ4","v":0},{"$f":"'[2]312 SO-Klassen'!DR4","v":0},{"$f":"'[2]312 SO-Klassen'!DS4","v":0},{"$f":"'[2]312 SO-Klassen'!DT4","v":0},{"$f":"'[2]312 SO-Klassen'!DU4","v":0},{"$f":"'[2]312 SO-Klassen'!DV4","v":0},{"$f":"'[2]312 SO-Klassen'!DW4","v":0},{"$f":"'[2]312 SO-Klassen'!DX4","v":0},{"$f":"'[2]312 SO-Klassen'!DY4","v":0},{"$f":"'[2]312 SO-Klassen'!DZ4","v":0},{"$f":"'[2]312 SO-Klassen'!EA4","v":0},{"$f":"'[2]312 SO-Klassen'!EB4","v":0},{"$f":"'[2]312 SO-Klassen'!EC4","v":0},{"$f":"'[2]312 SO-Klassen'!ED4","v":0},{"$f":"'[2]312 SO-Klassen'!EE4","v":0},{"$f":"'[2]312 SO-Klassen'!EF4","v":0},{"$f":"'[2]312 SO-Klassen'!EG4","v":0},{"$f":"'[2]312 SO-Klassen'!EH4","v":0},{"$f":"'[2]312 SO-Klassen'!EI4","v":0},{"$f":"'[2]312 SO-Klassen'!EJ4","v":0},{"$f":"'[2]312 SO-Klassen'!EK4","v":0},{"$f":"'[2]312 SO-Klassen'!EL4","v":0},{"$f":"'[2]312 SO-Klassen'!EM4","v":501013},{"$f":"'[2]312 SO-Klassen'!EN4","v":44475},{"$f":"'[2]312 SO-Klassen'!EO4","v":"genehmigt"},{"$f":"'[2]312 SO-Klassen'!EP4","v":"2021-10-06"},{"$f":"'[2]312 SO-Klassen'!EQ4","v":1},{"$f":"'[2]312 SO-Klassen'!ER4","v":0},{"$f":"'[2]312 SO-Klassen'!ES4","v":0},{"$f":"'[2]312 SO-Klassen'!ET4","v":2},{"$f":"'[2]312 SO-Klassen'!EU4","v":0}]
[{"$f":"'[2]312 SO-Klassen'!B5","v":"2021/22"},{"$f":"'[2]312 SO-Klassen'!C5","v":"1"},{"$f":"'[2]312 SO-Klassen'!D5","v":"3"},{"$f":"'[2]312 SO-Klassen'!E5","v":501013},{"$f":"'[2]312 SO-Klassen'!F5","v":"SO Salzburg"},{"$f":"'[2]312 SO-Klassen'!G5","v":2},{"$f":"'[2]312 SO-Klassen'!H5","v":"2021-10-01"},{"$f":"'[2]312 SO-Klassen'!I5","v":3},{"$f":"'[2]312 SO-Klassen'!J5","v":"07"},{"$f":"'[2]312 SO-Klassen'!K5","v":"2agk1"},{"$f":"'[2]312 SO-Klassen'!L5","v":1},{"$f":"'[2]312 SO-Klassen'!M5","v":0},{"$f":"'[2]312 SO-Klassen'!N5","v":0},{"$f":"'[2]312 SO-Klassen'!O5","v":0},{"$f":"'[2]312 SO-Klassen'!P5","v":0},{"$f":"'[2]312 SO-Klassen'!Q5","v":0},{"$f":"'[2]312 SO-Klassen'!R5","v":1},{"$f":"'[2]312 SO-Klassen'!S5","v":0},{"$f":"'[2]312 SO-Klassen'!T5","v":0},{"$f":"'[2]312 SO-Klassen'!U5","v":0},{"$f":"'[2]312 SO-Klassen'!V5","v":0},{"$f":"'[2]312 SO-Klassen'!W5","v":0},{"$f":"'[2]312 SO-Klassen'!X5","v":0},{"$f":"'[2]312 SO-Klassen'!Y5","v":0},{"$f":"'[2]312 SO-Klassen'!Z5","v":0},{"$f":"'[2]312 SO-Klassen'!AA5","v":0},{"$f":"'[2]312 SO-Klassen'!AB5","v":0},{"$f":"'[2]312 SO-Klassen'!AC5","v":1},{"$f":"'[2]312 SO-Klassen'!AD5","v":1},{"$f":"'[2]312 SO-Klassen'!AE5","v":0},{"$f":"'[2]312 SO-Klassen'!AF5","v":0},{"$f":"'[2]312 SO-Klassen'!AG5","v":0},{"$f":"'[2]312 SO-Klassen'!AH5","v":0},{"$f":"'[2]312 SO-Klassen'!AI5","v":0},{"$f":"'[2]312 SO-Klassen'!AJ5","v":0},{"$f":"'[2]312 SO-Klassen'!AK5","v":0},{"$f":"'[2]312 SO-Klassen'!AL5","v":3},{"$f":"'[2]312 SO-Klassen'!AM5","v":3},{"$f":"'[2]312 SO-Klassen'!AN5","v":1},{"$f":"'[2]312 SO-Klassen'!AO5","v":4},{"$f":"'[2]312 SO-Klassen'!AP5","v":4},{"$f":"'[2]312 SO-Klassen'!AQ5","v":0},{"$f":"'[2]312 SO-Klassen'!AR5","v":1},{"$f":"'[2]312 SO-Klassen'!AS5","v":1},{"$f":"'[2]312 SO-Klassen'!AT5","v":0},{"$f":"'[2]312 SO-Klassen'!AU5","v":0},{"$f":"'[2]312 SO-Klassen'!AV5","v":0},{"$f":"'[2]312 SO-Klassen'!AW5","v":5},{"$f":"'[2]312 SO-Klassen'!AX5","v":0},{"$f":"'[2]312 SO-Klassen'!AY5","v":0},{"$f":"'[2]312 SO-Klassen'!AZ5","v":2},{"$f":"'[2]312 SO-Klassen'!BA5","v":2},{"$f":"'[2]312 SO-Klassen'!BB5","v":0},{"$f":"'[2]312 SO-Klassen'!BC5","v":0},{"$f":"'[2]312 SO-Klassen'!BD5","v":0},{"$f":"'[2]312 SO-Klassen'!BE5","v":0},{"$f":"'[2]312 SO-Klassen'!BF5","v":2},{"$f":"'[2]312 SO-Klassen'!BG5","v":1},{"$f":"'[2]312 SO-Klassen'!BH5","v":0},{"$f":"'[2]312 SO-Klassen'!BI5","v":1},{"$f":"'[2]312 SO-Klassen'!BJ5","v":1},{"$f":"'[2]312 SO-Klassen'!BK5","v":0},{"$f":"'[2]312 SO-Klassen'!BL5","v":0},{"$f":"'[2]312 SO-Klassen'!BM5","v":0},{"$f":"'[2]312 SO-Klassen'!BN5","v":0},{"$f":"'[2]312 SO-Klassen'!BO5","v":1},{"$f":"'[2]312 SO-Klassen'!BP5","v":0},{"$f":"'[2]312 SO-Klassen'!BQ5","v":0},{"$f":"'[2]312 SO-Klassen'!BR5","v":0},{"$f":"'[2]312 SO-Klassen'!BS5","v":0},{"$f":"'[2]312 SO-Klassen'!BT5","v":0},{"$f":"'[2]312 SO-Klassen'!BU5","v":0},{"$f":"'[2]312 SO-Klassen'!BV5","v":0},{"$f":"'[2]312 SO-Klassen'!BW5","v":0},{"$f":"'[2]312 SO-Klassen'!BX5","v":1},{"$f":"'[2]312 SO-Klassen'!BY5","v":0},{"$f":"'[2]312 SO-Klassen'!BZ5","v":0},{"$f":"'[2]312 SO-Klassen'!CA5","v":0},{"$f":"'[2]312 SO-Klassen'!CB5","v":1},{"$f":"'[2]312 SO-Klassen'!CC5","v":1},{"$f":"'[2]312 SO-Klassen'!CD5","v":2},{"$f":"'[2]312 SO-Klassen'!CE5","v":0},{"$f":"'[2]312 SO-Klassen'!CF5","v":0},{"$f":"'[2]312 SO-Klassen'!CG5","v":0},{"$f":"'[2]312 SO-Klassen'!CH5","v":1},{"$f":"'[2]312 SO-Klassen'!CI5","v":0},{"$f":"'[2]312 SO-Klassen'!CJ5","v":0},{"$f":"'[2]312 SO-Klassen'!CK5","v":3},{"$f":"'[2]312 SO-Klassen'!CL5","v":4},{"$f":"'[2]312 SO-Klassen'!CM5","v":0},{"$f":"'[2]312 SO-Klassen'!CN5","v":0},{"$f":"'[2]312 SO-Klassen'!CO5","v":0},{"$f":"'[2]312 SO-Klassen'!CP5","v":0},{"$f":"'[2]312 SO-Klassen'!CQ5","v":0},{"$f":"'[2]312 SO-Klassen'!CR5","v":0},{"$f":"'[2]312 SO-Klassen'!CS5","v":0},{"$f":"'[2]312 SO-Klassen'!CT5","v":0},{"$f":"'[2]312 SO-Klassen'!CU5","v":0},{"$f":"'[2]312 SO-Klassen'!CV5","v":0},{"$f":"'[2]312 SO-Klassen'!CW5","v":1},{"$f":"'[2]312 SO-Klassen'!CX5","v":0},{"$f":"'[2]312 SO-Klassen'!CY5","v":0},{"$f":"'[2]312 SO-Klassen'!CZ5","v":0},{"$f":"'[2]312 SO-Klassen'!DA5","v":0},{"$f":"'[2]312 SO-Klassen'!DB5","v":0},{"$f":"'[2]312 SO-Klassen'!DC5","v":0},{"$f":"'[2]312 SO-Klassen'!DD5","v":0},{"$f":"'[2]312 SO-Klassen'!DE5","v":0},{"$f":"'[2]312 SO-Klassen'!DF5","v":0},{"$f":"'[2]312 SO-Klassen'!DG5","v":0},{"$f":"'[2]312 SO-Klassen'!DH5","v":0},{"$f":"'[2]312 SO-Klassen'!DI5","v":0},{"$f":"'[2]312 SO-Klassen'!DJ5","v":0},{"$f":"'[2]312 SO-Klassen'!DK5","v":0},{"$f":"'[2]312 SO-Klassen'!DL5","v":0},{"$f":"'[2]312 SO-Klassen'!DM5","v":0},{"$f":"'[2]312 SO-Klassen'!DN5","v":0},{"$f":"'[2]312 SO-Klassen'!DO5","v":0},{"$f":"'[2]312 SO-Klassen'!DP5","v":0},{"$f":"'[2]312 SO-Klassen'!DQ5","v":0},{"$f":"'[2]312 SO-Klassen'!DR5","v":0},{"$f":"'[2]312 SO-Klassen'!DS5","v":0},{"$f":"'[2]312 SO-Klassen'!DT5","v":0},{"$f":"'[2]312 SO-Klassen'!DU5","v":0},{"$f":"'[2]312 SO-Klassen'!DV5","v":0},{"$f":"'[2]312 SO-Klassen'!DW5","v":0},{"$f":"'[2]312 SO-Klassen'!DX5","v":0},{"$f":"'[2]312 SO-Klassen'!DY5","v":0},{"$f":"'[2]312 SO-Klassen'!DZ5","v":0},{"$f":"'[2]312 SO-Klassen'!EA5","v":0},{"$f":"'[2]312 SO-Klassen'!EB5","v":0},{"$f":"'[2]312 SO-Klassen'!EC5","v":0},{"$f":"'[2]312 SO-Klassen'!ED5","v":0},{"$f":"'[2]312 SO-Klassen'!EE5","v":0},{"$f":"'[2]312 SO-Klassen'!EF5","v":0},{"$f":"'[2]312 SO-Klassen'!EG5","v":0},{"$f":"'[2]312 SO-Klassen'!EH5","v":0},{"$f":"'[2]312 SO-Klassen'!EI5","v":0},{"$f":"'[2]312 SO-Klassen'!EJ5","v":0},{"$f":"'[2]312 SO-Klassen'!EK5","v":0},{"$f":"'[2]312 SO-Klassen'!EL5","v":0},{"$f":"'[2]312 SO-Klassen'!EM5","v":501013},{"$f":"'[2]312 SO-Klassen'!EN5","v":44475},{"$f":"'[2]312 SO-Klassen'!EO5","v":"genehmigt"},{"$f":"'[2]312 SO-Klassen'!EP5","v":"2021-10-06"},{"$f":"'[2]312 SO-Klassen'!EQ5","v":0},{"$f":"'[2]312 SO-Klassen'!ER5","v":0},{"$f":"'[2]312 SO-Klassen'!ES5","v":0},{"$f":"'[2]312 SO-Klassen'!ET5","v":5},{"$f":"'[2]312 SO-Klassen'!EU5","v":0}]
[{"$f":"'[2]312 SO-Klassen'!B6","v":"2021/22"},{"$f":"'[2]312 SO-Klassen'!C6","v":"1"},{"$f":"'[2]312 SO-Klassen'!D6","v":"3"},{"$f":"'[2]312 SO-Klassen'!E6","v":501013},{"$f":"'[2]312 SO-Klassen'!F6","v":"SO Salzburg"},{"$f":"'[2]312 SO-Klassen'!G6","v":2},{"$f":"'[2]312 SO-Klassen'!H6","v":"2021-10-01"},{"$f":"'[2]312 SO-Klassen'!I6","v":3},{"$f":"'[2]312 SO-Klassen'!J6","v":"07"},{"$f":"'[2]312 SO-Klassen'!K6","v":"3MS1"},{"$f":"'[2]312 SO-Klassen'!L6","v":1},{"$f":"'[2]312 SO-Klassen'!M6","v":0},{"$f":"'[2]312 SO-Klassen'!N6","v":0},{"$f":"'[2]312 SO-Klassen'!O6","v":0},{"$f":"'[2]312 SO-Klassen'!P6","v":0},{"$f":"'[2]312 SO-Klassen'!Q6","v":0},{"$f":"'[2]312 SO-Klassen'!R6","v":1},{"$f":"'[2]312 SO-Klassen'!S6","v":0},{"$f":"'[2]312 SO-Klassen'!T6","v":0},{"$f":"'[2]312 SO-Klassen'!U6","v":0},{"$f":"'[2]312 SO-Klassen'!V6","v":0},{"$f":"'[2]312 SO-Klassen'!W6","v":0},{"$f":"'[2]312 SO-Klassen'!X6","v":0},{"$f":"'[2]312 SO-Klassen'!Y6","v":0},{"$f":"'[2]312 SO-Klassen'!Z6","v":0},{"$f":"'[2]312 SO-Klassen'!AA6","v":0},{"$f":"'[2]312 SO-Klassen'!AB6","v":0},{"$f":"'[2]312 SO-Klassen'!AC6","v":0},{"$f":"'[2]312 SO-Klassen'!AD6","v":0},{"$f":"'[2]312 SO-Klassen'!AE6","v":0},{"$f":"'[2]312 SO-Klassen'!AF6","v":0},{"$f":"'[2]312 SO-Klassen'!AG6","v":0},{"$f":"'[2]312 SO-Klassen'!AH6","v":0},{"$f":"'[2]312 SO-Klassen'!AI6","v":0},{"$f":"'[2]312 SO-Klassen'!AJ6","v":0},{"$f":"'[2]312 SO-Klassen'!AK6","v":0},{"$f":"'[2]312 SO-Klassen'!AL6","v":0},{"$f":"'[2]312 SO-Klassen'!AM6","v":0},{"$f":"'[2]312 SO-Klassen'!AN6","v":1},{"$f":"'[2]312 SO-Klassen'!AO6","v":14},{"$f":"'[2]312 SO-Klassen'!AP6","v":9},{"$f":"'[2]312 SO-Klassen'!AQ6","v":0},{"$f":"'[2]312 SO-Klassen'!AR6","v":0},{"$f":"'[2]312 SO-Klassen'!AS6","v":0},{"$f":"'[2]312 SO-Klassen'!AT6","v":0},{"$f":"'[2]312 SO-Klassen'!AU6","v":0},{"$f":"'[2]312 SO-Klassen'!AV6","v":0},{"$f":"'[2]312 SO-Klassen'!AW6","v":13},{"$f":"'[2]312 SO-Klassen'!AX6","v":0},{"$f":"'[2]312 SO-Klassen'!AY6","v":0},{"$f":"'[2]312 SO-Klassen'!AZ6","v":3},{"$f":"'[2]312 SO-Klassen'!BA6","v":3},{"$f":"'[2]312 SO-Klassen'!BB6","v":0},{"$f":"'[2]312 SO-Klassen'!BC6","v":0},{"$f":"'[2]312 SO-Klassen'!BD6","v":0},{"$f":"'[2]312 SO-Klassen'!BE6","v":0},{"$f":"'[2]312 SO-Klassen'!BF6","v":7},{"$f":"'[2]312 SO-Klassen'!BG6","v":6},{"$f":"'[2]312 SO-Klassen'!BH6","v":0},{"$f":"'[2]312 SO-Klassen'!BI6","v":3},{"$f":"'[2]312 SO-Klassen'!BJ6","v":3},{"$f":"'[2]312 SO-Klassen'!BK6","v":0},{"$f":"'[2]312 SO-Klassen'!BL6","v":0},{"$f":"'[2]312 SO-Klassen'!BM6","v":0},{"$f":"'[2]312 SO-Klassen'!BN6","v":0},{"$f":"'[2]312 SO-Klassen'!BO6","v":1},{"$f":"'[2]312 SO-Klassen'!BP6","v":0},{"$f":"'[2]312 SO-Klassen'!BQ6","v":0},{"$f":"'[2]312 SO-Klassen'!BR6","v":0},{"$f":"'[2]312 SO-Klassen'!BS6","v":0},{"$f":"'[2]312 SO-Klassen'!BT6","v":0},{"$f":"'[2]312 SO-Klassen'!BU6","v":0},{"$f":"'[2]312 SO-Klassen'!BV6","v":0},{"$f":"'[2]312 SO-Klassen'!BW6","v":0},{"$f":"'[2]312 SO-Klassen'!BX6","v":1},{"$f":"'[2]312 SO-Klassen'!BY6","v":0},{"$f":"'[2]312 SO-Klassen'!BZ6","v":0},{"$f":"'[2]312 SO-Klassen'!CA6","v":0},{"$f":"'[2]312 SO-Klassen'!CB6","v":1},{"$f":"'[2]312 SO-Klassen'!CC6","v":2},{"$f":"'[2]312 SO-Klassen'!CD6","v":2},{"$f":"'[2]312 SO-Klassen'!CE6","v":0},{"$f":"'[2]312 SO-Klassen'!CF6","v":0},{"$f":"'[2]312 SO-Klassen'!CG6","v":0},{"$f":"'[2]312 SO-Klassen'!CH6","v":0},{"$f":"'[2]312 SO-Klassen'!CI6","v":0},{"$f":"'[2]312 SO-Klassen'!CJ6","v":0},{"$f":"'[2]312 SO-Klassen'!CK6","v":0},{"$f":"'[2]312 SO-Klassen'!CL6","v":7},{"$f":"'[2]312 SO-Klassen'!CM6","v":0},{"$f":"'[2]312 SO-Klassen'!CN6","v":0},{"$f":"'[2]312 SO-Klassen'!CO6","v":0},{"$f":"'[2]312 SO-Klassen'!CP6","v":0},{"$f":"'[2]312 SO-Klassen'!CQ6","v":0},{"$f":"'[2]312 SO-Klassen'!CR6","v":0},{"$f":"'[2]312 SO-Klassen'!CS6","v":0},{"$f":"'[2]312 SO-Klassen'!CT6","v":0},{"$f":"'[2]312 SO-Klassen'!CU6","v":0},{"$f":"'[2]312 SO-Klassen'!CV6","v":1},{"$f":"'[2]312 SO-Klassen'!CW6","v":0},{"$f":"'[2]312 SO-Klassen'!CX6","v":0},{"$f":"'[2]312 SO-Klassen'!CY6","v":0},{"$f":"'[2]312 SO-Klassen'!CZ6","v":0},{"$f":"'[2]312 SO-Klassen'!DA6","v":0},{"$f":"'[2]312 SO-Klassen'!DB6","v":0},{"$f":"'[2]312 SO-Klassen'!DC6","v":0},{"$f":"'[2]312 SO-Klassen'!DD6","v":0},{"$f":"'[2]312 SO-Klassen'!DE6","v":0},{"$f":"'[2]312 SO-Klassen'!DF6","v":0},{"$f":"'[2]312 SO-Klassen'!DG6","v":0},{"$f":"'[2]312 SO-Klassen'!DH6","v":0},{"$f":"'[2]312 SO-Klassen'!DI6","v":0},{"$f":"'[2]312 SO-Klassen'!DJ6","v":0},{"$f":"'[2]312 SO-Klassen'!DK6","v":0},{"$f":"'[2]312 SO-Klassen'!DL6","v":0},{"$f":"'[2]312 SO-Klassen'!DM6","v":0},{"$f":"'[2]312 SO-Klassen'!DN6","v":0},{"$f":"'[2]312 SO-Klassen'!DO6","v":0},{"$f":"'[2]312 SO-Klassen'!DP6","v":0},{"$f":"'[2]312 SO-Klassen'!DQ6","v":0},{"$f":"'[2]312 SO-Klassen'!DR6","v":0},{"$f":"'[2]312 SO-Klassen'!DS6","v":0},{"$f":"'[2]312 SO-Klassen'!DT6","v":0},{"$f":"'[2]312 SO-Klassen'!DU6","v":0},{"$f":"'[2]312 SO-Klassen'!DV6","v":0},{"$f":"'[2]312 SO-Klassen'!DW6","v":0},{"$f":"'[2]312 SO-Klassen'!DX6","v":0},{"$f":"'[2]312 SO-Klassen'!DY6","v":0},{"$f":"'[2]312 SO-Klassen'!DZ6","v":0},{"$f":"'[2]312 SO-Klassen'!EA6","v":0},{"$f":"'[2]312 SO-Klassen'!EB6","v":0},{"$f":"'[2]312 SO-Klassen'!EC6","v":0},{"$f":"'[2]312 SO-Klassen'!ED6","v":0},{"$f":"'[2]312 SO-Klassen'!EE6","v":0},{"$f":"'[2]312 SO-Klassen'!EF6","v":0},{"$f":"'[2]312 SO-Klassen'!EG6","v":0},{"$f":"'[2]312 SO-Klassen'!EH6","v":0},{"$f":"'[2]312 SO-Klassen'!EI6","v":0},{"$f":"'[2]312 SO-Klassen'!EJ6","v":0},{"$f":"'[2]312 SO-Klassen'!EK6","v":0},{"$f":"'[2]312 SO-Klassen'!EL6","v":0},{"$f":"'[2]312 SO-Klassen'!EM6","v":501013},{"$f":"'[2]312 SO-Klassen'!EN6","v":44475},{"$f":"'[2]312 SO-Klassen'!EO6","v":"genehmigt"},{"$f":"'[2]312 SO-Klassen'!EP6","v":"2021-10-06"},{"$f":"'[2]312 SO-Klassen'!EQ6","v":0},{"$f":"'[2]312 SO-Klassen'!ER6","v":0},{"$f":"'[2]312 SO-Klassen'!ES6","v":0},{"$f":"'[2]312 SO-Klassen'!ET6","v":13},{"$f":"'[2]312 SO-Klassen'!EU6","v":0}]
[{"$f":"'[2]312 SO-Klassen'!B7","v":"2021/22"},{"$f":"'[2]312 SO-Klassen'!C7","v":"1"},{"$f":"'[2]312 SO-Klassen'!D7","v":"3"},{"$f":"'[2]312 SO-Klassen'!E7","v":501013},{"$f":"'[2]312 SO-Klassen'!F7","v":"SO Salzburg"},{"$f":"'[2]312 SO-Klassen'!G7","v":2},{"$f":"'[2]312 SO-Klassen'!H7","v":"2021-10-01"},{"$f":"'[2]312 SO-Klassen'!I7","v":3},{"$f":"'[2]312 SO-Klassen'!J7","v":"08"},{"$f":"'[2]312 SO-Klassen'!K7","v":"1LOK"},{"$f":"'[2]312 SO-Klassen'!L7","v":1},{"$f":"'[2]312 SO-Klassen'!M7","v":0},{"$f":"'[2]312 SO-Klassen'!N7","v":0},{"$f":"'[2]312 SO-Klassen'!O7","v":0},{"$f":"'[2]312 SO-Klassen'!P7","v":0},{"$f":"'[2]312 SO-Klassen'!Q7","v":0},{"$f":"'[2]312 SO-Klassen'!R7","v":1},{"$f":"'[2]312 SO-Klassen'!S7","v":0},{"$f":"'[2]312 SO-Klassen'!T7","v":0},{"$f":"'[2]312 SO-Klassen'!U7","v":0},{"$f":"'[2]312 SO-Klassen'!V7","v":0},{"$f":"'[2]312 SO-Klassen'!W7","v":0},{"$f":"'[2]312 SO-Klassen'!X7","v":0},{"$f":"'[2]312 SO-Klassen'!Y7","v":0},{"$f":"'[2]312 SO-Klassen'!Z7","v":0},{"$f":"'[2]312 SO-Klassen'!AA7","v":0},{"$f":"'[2]312 SO-Klassen'!AB7","v":0},{"$f":"'[2]312 SO-Klassen'!AC7","v":0},{"$f":"'[2]312 SO-Klassen'!AD7","v":0},{"$f":"'[2]312 SO-Klassen'!AE7","v":0},{"$f":"'[2]312 SO-Klassen'!AF7","v":0},{"$f":"'[2]312 SO-Klassen'!AG7","v":0},{"$f":"'[2]312 SO-Klassen'!AH7","v":0},{"$f":"'[2]312 SO-Klassen'!AI7","v":1},{"$f":"'[2]312 SO-Klassen'!AJ7","v":1},{"$f":"'[2]312 SO-Klassen'!AK7","v":0},{"$f":"'[2]312 SO-Klassen'!AL7","v":1},{"$f":"'[2]312 SO-Klassen'!AM7","v":1},{"$f":"'[2]312 SO-Klassen'!AN7","v":0},{"$f":"'[2]312 SO-Klassen'!AO7","v":4},{"$f":"'[2]312 SO-Klassen'!AP7","v":4},{"$f":"'[2]312 SO-Klassen'!AQ7","v":1},{"$f":"'[2]312 SO-Klassen'!AR7","v":0},{"$f":"'[2]312 SO-Klassen'!AS7","v":0},{"$f":"'[2]312 SO-Klassen'!AT7","v":0},{"$f":"'[2]312 SO-Klassen'!AU7","v":2},{"$f":"'[2]312 SO-Klassen'!AV7","v":2},{"$f":"'[2]312 SO-Klassen'!AW7","v":7},{"$f":"'[2]312 SO-Klassen'!AX7","v":0},{"$f":"'[2]312 SO-Klassen'!AY7","v":0},{"$f":"'[2]312 SO-Klassen'!AZ7","v":0},{"$f":"'[2]312 SO-Klassen'!BA7","v":0},{"$f":"'[2]312 SO-Klassen'!BB7","v":0},{"$f":"'[2]312 SO-Klassen'!BC7","v":0},{"$f":"'[2]312 SO-Klassen'!BD7","v":0},{"$f":"'[2]312 SO-Klassen'!BE7","v":0},{"$f":"'[2]312 SO-Klassen'!BF7","v":4},{"$f":"'[2]312 SO-Klassen'!BG7","v":4},{"$f":"'[2]312 SO-Klassen'!BH7","v":0},{"$f":"'[2]312 SO-Klassen'!BI7","v":2},{"$f":"'[2]312 SO-Klassen'!BJ7","v":2},{"$f":"'[2]312 SO-Klassen'!BK7","v":0},{"$f":"'[2]312 SO-Klassen'!BL7","v":0},{"$f":"'[2]312 SO-Klassen'!BM7","v":0},{"$f":"'[2]312 SO-Klassen'!BN7","v":0},{"$f":"'[2]312 SO-Klassen'!BO7","v":1},{"$f":"'[2]312 SO-Klassen'!BP7","v":0},{"$f":"'[2]312 SO-Klassen'!BQ7","v":0},{"$f":"'[2]312 SO-Klassen'!BR7","v":0},{"$f":"'[2]312 SO-Klassen'!BS7","v":0},{"$f":"'[2]312 SO-Klassen'!BT7","v":0},{"$f":"'[2]312 SO-Klassen'!BU7","v":0},{"$f":"'[2]312 SO-Klassen'!BV7","v":0},{"$f":"'[2]312 SO-Klassen'!BW7","v":1},{"$f":"'[2]312 SO-Klassen'!BX7","v":0},{"$f":"'[2]312 SO-Klassen'!BY7","v":0},{"$f":"'[2]312 SO-Klassen'!BZ7","v":0},{"$f":"'[2]312 SO-Klassen'!CA7","v":0},{"$f":"'[2]312 SO-Klassen'!CB7","v":1},{"$f":"'[2]312 SO-Klassen'!CC7","v":1},{"$f":"'[2]312 SO-Klassen'!CD7","v":1},{"$f":"'[2]312 SO-Klassen'!CE7","v":0},{"$f":"'[2]312 SO-Klassen'!CF7","v":0},{"$f":"'[2]312 SO-Klassen'!CG7","v":0},{"$f":"'[2]312 SO-Klassen'!CH7","v":0},{"$f":"'[2]312 SO-Klassen'!CI7","v":0},{"$f":"'[2]312 SO-Klassen'!CJ7","v":1},{"$f":"'[2]312 SO-Klassen'!CK7","v":1},{"$f":"'[2]312 SO-Klassen'!CL7","v":3},{"$f":"'[2]312 SO-Klassen'!CM7","v":0},{"$f":"'[2]312 SO-Klassen'!CN7","v":0},{"$f":"'[2]312 SO-Klassen'!CO7","v":0},{"$f":"'[2]312 SO-Klassen'!CP7","v":0},{"$f":"'[2]312 SO-Klassen'!CQ7","v":0},{"$f":"'[2]312 SO-Klassen'!CR7","v":0},{"$f":"'[2]312 SO-Klassen'!CS7","v":0},{"$f":"'[2]312 SO-Klassen'!CT7","v":0},{"$f":"'[2]312 SO-Klassen'!CU7","v":0},{"$f":"'[2]312 SO-Klassen'!CV7","v":1},{"$f":"'[2]312 SO-Klassen'!CW7","v":0},{"$f":"'[2]312 SO-Klassen'!CX7","v":0},{"$f":"'[2]312 SO-Klassen'!CY7","v":0},{"$f":"'[2]312 SO-Klassen'!CZ7","v":0},{"$f":"'[2]312 SO-Klassen'!DA7","v":0},{"$f":"'[2]312 SO-Klassen'!DB7","v":0},{"$f":"'[2]312 SO-Klassen'!DC7","v":0},{"$f":"'[2]312 SO-Klassen'!DD7","v":0},{"$f":"'[2]312 SO-Klassen'!DE7","v":0},{"$f":"'[2]312 SO-Klassen'!DF7","v":0},{"$f":"'[2]312 SO-Klassen'!DG7","v":0},{"$f":"'[2]312 SO-Klassen'!DH7","v":2},{"$f":"'[2]312 SO-Klassen'!DI7","v":0},{"$f":"'[2]312 SO-Klassen'!DJ7","v":0},{"$f":"'[2]312 SO-Klassen'!DK7","v":0},{"$f":"'[2]312 SO-Klassen'!DL7","v":0},{"$f":"'[2]312 SO-Klassen'!DM7","v":0},{"$f":"'[2]312 SO-Klassen'!DN7","v":0},{"$f":"'[2]312 SO-Klassen'!DO7","v":0},{"$f":"'[2]312 SO-Klassen'!DP7","v":0},{"$f":"'[2]312 SO-Klassen'!DQ7","v":0},{"$f":"'[2]312 SO-Klassen'!DR7","v":0},{"$f":"'[2]312 SO-Klassen'!DS7","v":0},{"$f":"'[2]312 SO-Klassen'!DT7","v":0},{"$f":"'[2]312 SO-Klassen'!DU7","v":0},{"$f":"'[2]312 SO-Klassen'!DV7","v":0},{"$f":"'[2]312 SO-Klassen'!DW7","v":0},{"$f":"'[2]312 SO-Klassen'!DX7","v":0},{"$f":"'[2]312 SO-Klassen'!DY7","v":0},{"$f":"'[2]312 SO-Klassen'!DZ7","v":0},{"$f":"'[2]312 SO-Klassen'!EA7","v":0},{"$f":"'[2]312 SO-Klassen'!EB7","v":0},{"$f":"'[2]312 SO-Klassen'!EC7","v":0},{"$f":"'[2]312 SO-Klassen'!ED7","v":0},{"$f":"'[2]312 SO-Klassen'!EE7","v":0},{"$f":"'[2]312 SO-Klassen'!EF7","v":0},{"$f":"'[2]312 SO-Klassen'!EG7","v":0},{"$f":"'[2]312 SO-Klassen'!EH7","v":0},{"$f":"'[2]312 SO-Klassen'!EI7","v":0},{"$f":"'[2]312 SO-Klassen'!EJ7","v":0},{"$f":"'[2]312 SO-Klassen'!EK7","v":0},{"$f":"'[2]312 SO-Klassen'!EL7","v":0},{"$f":"'[2]312 SO-Klassen'!EM7","v":501013},{"$f":"'[2]312 SO-Klassen'!EN7","v":44475},{"$f":"'[2]312 SO-Klassen'!EO7","v":"genehmigt"},{"$f":"'[2]312 SO-Klassen'!EP7","v":"2021-10-06"},{"$f":"'[2]312 SO-Klassen'!EQ7","v":0},{"$f":"'[2]312 SO-Klassen'!ER7","v":0},{"$f":"'[2]312 SO-Klassen'!ES7","v":0},{"$f":"'[2]312 SO-Klassen'!ET7","v":5},{"$f":"'[2]312 SO-Klassen'!EU7","v":0}]
[{"$f":"'[2]312 SO-Klassen'!B8","v":"2021/22"},{"$f":"'[2]312 SO-Klassen'!C8","v":"1"},{"$f":"'[2]312 SO-Klassen'!D8","v":"3"},{"$f":"'[2]312 SO-Klassen'!E8","v":501013},{"$f":"'[2]312 SO-Klassen'!F8","v":"SO Salzburg"},{"$f":"'[2]312 SO-Klassen'!G8","v":2},{"$f":"'[2]312 SO-Klassen'!H8","v":"2021-10-01"},{"$f":"'[2]312 SO-Klassen'!I8","v":3},{"$f":"'[2]312 SO-Klassen'!J8","v":"08"},{"$f":"'[2]312 SO-Klassen'!K8","v":"2fam1"},{"$f":"'[2]312 SO-Klassen'!L8","v":0},{"$f":"'[2]312 SO-Klassen'!M8","v":0},{"$f":"'[2]312 SO-Klassen'!N8","v":0},{"$f":"'[2]312 SO-Klassen'!O8","v":1},{"$f":"'[2]312 SO-Klassen'!P8","v":0},{"$f":"'[2]312 SO-Klassen'!Q8","v":0},{"$f":"'[2]312 SO-Klassen'!R8","v":1},{"$f":"'[2]312 SO-Klassen'!S8","v":0},{"$f":"'[2]312 SO-Klassen'!T8","v":0},{"$f":"'[2]312 SO-Klassen'!U8","v":0},{"$f":"'[2]312 SO-Klassen'!V8","v":0},{"$f":"'[2]312 SO-Klassen'!W8","v":0},{"$f":"'[2]312 SO-Klassen'!X8","v":0},{"$f":"'[2]312 SO-Klassen'!Y8","v":0},{"$f":"'[2]312 SO-Klassen'!Z8","v":0},{"$f":"'[2]312 SO-Klassen'!AA8","v":0},{"$f":"'[2]312 SO-Klassen'!AB8","v":0},{"$f":"'[2]312 SO-Klassen'!AC8","v":1},{"$f":"'[2]312 SO-Klassen'!AD8","v":1},{"$f":"'[2]312 SO-Klassen'!AE8","v":0},{"$f":"'[2]312 SO-Klassen'!AF8","v":1},{"$f":"'[2]312 SO-Klassen'!AG8","v":1},{"$f":"'[2]312 SO-Klassen'!AH8","v":0},{"$f":"'[2]312 SO-Klassen'!AI8","v":0},{"$f":"'[2]312 SO-Klassen'!AJ8","v":0},{"$f":"'[2]312 SO-Klassen'!AK8","v":0},{"$f":"'[2]312 SO-Klassen'!AL8","v":3},{"$f":"'[2]312 SO-Klassen'!AM8","v":3},{"$f":"'[2]312 SO-Klassen'!AN8","v":0},{"$f":"'[2]312 SO-Klassen'!AO8","v":2},{"$f":"'[2]312 SO-Klassen'!AP8","v":2},{"$f":"'[2]312 SO-Klassen'!AQ8","v":1},{"$f":"'[2]312 SO-Klassen'!AR8","v":2},{"$f":"'[2]312 SO-Klassen'!AS8","v":2},{"$f":"'[2]312 SO-Klassen'!AT8","v":0},{"$f":"'[2]312 SO-Klassen'!AU8","v":1},{"$f":"'[2]312 SO-Klassen'!AV8","v":1},{"$f":"'[2]312 SO-Klassen'!AW8","v":5},{"$f":"'[2]312 SO-Klassen'!AX8","v":0},{"$f":"'[2]312 SO-Klassen'!AY8","v":0},{"$f":"'[2]312 SO-Klassen'!AZ8","v":3},{"$f":"'[2]312 SO-Klassen'!BA8","v":2},{"$f":"'[2]312 SO-Klassen'!BB8","v":0},{"$f":"'[2]312 SO-Klassen'!BC8","v":0},{"$f":"'[2]312 SO-Klassen'!BD8","v":0},{"$f":"'[2]312 SO-Klassen'!BE8","v":0},{"$f":"'[2]312 SO-Klassen'!BF8","v":3},{"$f":"'[2]312 SO-Klassen'!BG8","v":2},{"$f":"'[2]312 SO-Klassen'!BH8","v":0},{"$f":"'[2]312 SO-Klassen'!BI8","v":1},{"$f":"'[2]312 SO-Klassen'!BJ8","v":1},{"$f":"'[2]312 SO-Klassen'!BK8","v":0},{"$f":"'[2]312 SO-Klassen'!BL8","v":0},{"$f":"'[2]312 SO-Klassen'!BM8","v":0},{"$f":"'[2]312 SO-Klassen'!BN8","v":0},{"$f":"'[2]312 SO-Klassen'!BO8","v":1},{"$f":"'[2]312 SO-Klassen'!BP8","v":0},{"$f":"'[2]312 SO-Klassen'!BQ8","v":0},{"$f":"'[2]312 SO-Klassen'!BR8","v":0},{"$f":"'[2]312 SO-Klassen'!BS8","v":0},{"$f":"'[2]312 SO-Klassen'!BT8","v":0},{"$f":"'[2]312 SO-Klassen'!BU8","v":0},{"$f":"'[2]312 SO-Klassen'!BV8","v":0},{"$f":"'[2]312 SO-Klassen'!BW8","v":0},{"$f":"'[2]312 SO-Klassen'!BX8","v":0},{"$f":"'[2]312 SO-Klassen'!BY8","v":1},{"$f":"'[2]312 SO-Klassen'!BZ8","v":0},{"$f":"'[2]312 SO-Klassen'!CA8","v":2},{"$f":"'[2]312 SO-Klassen'!CB8","v":0},{"$f":"'[2]312 SO-Klassen'!CC8","v":2},{"$f":"'[2]312 SO-Klassen'!CD8","v":2},{"$f":"'[2]312 SO-Klassen'!CE8","v":0},{"$f":"'[2]312 SO-Klassen'!CF8","v":0},{"$f":"'[2]312 SO-Klassen'!CG8","v":0},{"$f":"'[2]312 SO-Klassen'!CH8","v":1},{"$f":"'[2]312 SO-Klassen'!CI8","v":1},{"$f":"'[2]312 SO-Klassen'!CJ8","v":0},{"$f":"'[2]312 SO-Klassen'!CK8","v":1},{"$f":"'[2]312 SO-Klassen'!CL8","v":0},{"$f":"'[2]312 SO-Klassen'!CM8","v":0},{"$f":"'[2]312 SO-Klassen'!CN8","v":0},{"$f":"'[2]312 SO-Klassen'!CO8","v":0},{"$f":"'[2]312 SO-Klassen'!CP8","v":0},{"$f":"'[2]312 SO-Klassen'!CQ8","v":0},{"$f":"'[2]312 SO-Klassen'!CR8","v":0},{"$f":"'[2]312 SO-Klassen'!CS8","v":0},{"$f":"'[2]312 SO-Klassen'!CT8","v":0},{"$f":"'[2]312 SO-Klassen'!CU8","v":0},{"$f":"'[2]312 SO-Klassen'!CV8","v":0},{"$f":"'[2]312 SO-Klassen'!CW8","v":0},{"$f":"'[2]312 SO-Klassen'!CX8","v":0},{"$f":"'[2]312 SO-Klassen'!CY8","v":0},{"$f":"'[2]312 SO-Klassen'!CZ8","v":0},{"$f":"'[2]312 SO-Klassen'!DA8","v":0},{"$f":"'[2]312 SO-Klassen'!DB8","v":0},{"$f":"'[2]312 SO-Klassen'!DC8","v":0},{"$f":"'[2]312 SO-Klassen'!DD8","v":0},{"$f":"'[2]312 SO-Klassen'!DE8","v":2},{"$f":"'[2]312 SO-Klassen'!DF8","v":2},{"$f":"'[2]312 SO-Klassen'!DG8","v":2},{"$f":"'[2]312 SO-Klassen'!DH8","v":1},{"$f":"'[2]312 SO-Klassen'!DI8","v":0},{"$f":"'[2]312 SO-Klassen'!DJ8","v":0},{"$f":"'[2]312 SO-Klassen'!DK8","v":0},{"$f":"'[2]312 SO-Klassen'!DL8","v":0},{"$f":"'[2]312 SO-Klassen'!DM8","v":0},{"$f":"'[2]312 SO-Klassen'!DN8","v":0},{"$f":"'[2]312 SO-Klassen'!DO8","v":0},{"$f":"'[2]312 SO-Klassen'!DP8","v":0},{"$f":"'[2]312 SO-Klassen'!DQ8","v":0},{"$f":"'[2]312 SO-Klassen'!DR8","v":0},{"$f":"'[2]312 SO-Klassen'!DS8","v":0},{"$f":"'[2]312 SO-Klassen'!DT8","v":0},{"$f":"'[2]312 SO-Klassen'!DU8","v":0},{"$f":"'[2]312 SO-Klassen'!DV8","v":0},{"$f":"'[2]312 SO-Klassen'!DW8","v":0},{"$f":"'[2]312 SO-Klassen'!DX8","v":0},{"$f":"'[2]312 SO-Klassen'!DY8","v":0},{"$f":"'[2]312 SO-Klassen'!DZ8","v":0},{"$f":"'[2]312 SO-Klassen'!EA8","v":0},{"$f":"'[2]312 SO-Klassen'!EB8","v":0},{"$f":"'[2]312 SO-Klassen'!EC8","v":0},{"$f":"'[2]312 SO-Klassen'!ED8","v":0},{"$f":"'[2]312 SO-Klassen'!EE8","v":0},{"$f":"'[2]312 SO-Klassen'!EF8","v":0},{"$f":"'[2]312 SO-Klassen'!EG8","v":0},{"$f":"'[2]312 SO-Klassen'!EH8","v":0},{"$f":"'[2]312 SO-Klassen'!EI8","v":0},{"$f":"'[2]312 SO-Klassen'!EJ8","v":0},{"$f":"'[2]312 SO-Klassen'!EK8","v":0},{"$f":"'[2]312 SO-Klassen'!EL8","v":0},{"$f":"'[2]312 SO-Klassen'!EM8","v":501013},{"$f":"'[2]312 SO-Klassen'!EN8","v":44475},{"$f":"'[2]312 SO-Klassen'!EO8","v":"genehmigt"},{"$f":"'[2]312 SO-Klassen'!EP8","v":"2021-10-06"},{"$f":"'[2]312 SO-Klassen'!EQ8","v":0},{"$f":"'[2]312 SO-Klassen'!ER8","v":0},{"$f":"'[2]312 SO-Klassen'!ES8","v":0},{"$f":"'[2]312 SO-Klassen'!ET8","v":5},{"$f":"'[2]312 SO-Klassen'!EU8","v":0}]
[{"$f":"'[2]312 SO-Klassen'!B9","v":"2021/22"},{"$f":"'[2]312 SO-Klassen'!C9","v":"1"},{"$f":"'[2]312 SO-Klassen'!D9","v":"3"},{"$f":"'[2]312 SO-Klassen'!E9","v":501013},{"$f":"'[2]312 SO-Klassen'!F9","v":"SO Salzburg"},{"$f":"'[2]312 SO-Klassen'!G9","v":2},{"$f":"'[2]312 SO-Klassen'!H9","v":"2021-10-01"},{"$f":"'[2]312 SO-Klassen'!I9","v":3},{"$f":"'[2]312 SO-Klassen'!J9","v":"08"},{"$f":"'[2]312 SO-Klassen'!K9","v":"2fam2"},{"$f":"'[2]312 SO-Klassen'!L9","v":0},{"$f":"'[2]312 SO-Klassen'!M9","v":0},{"$f":"'[2]312 SO-Klassen'!N9","v":0},{"$f":"'[2]312 SO-Klassen'!O9","v":1},{"$f":"'[2]312 SO-Klassen'!P9","v":0},{"$f":"'[2]312 SO-Klassen'!Q9","v":0},{"$f":"'[2]312 SO-Klassen'!R9","v":1},{"$f":"'[2]312 SO-Klassen'!S9","v":0},{"$f":"'[2]312 SO-Klassen'!T9","v":0},{"$f":"'[2]312 SO-Klassen'!U9","v":0},{"$f":"'[2]312 SO-Klassen'!V9","v":0},{"$f":"'[2]312 SO-Klassen'!W9","v":0},{"$f":"'[2]312 SO-Klassen'!X9","v":0},{"$f":"'[2]312 SO-Klassen'!Y9","v":0},{"$f":"'[2]312 SO-Klassen'!Z9","v":0},{"$f":"'[2]312 SO-Klassen'!AA9","v":0},{"$f":"'[2]312 SO-Klassen'!AB9","v":0},{"$f":"'[2]312 SO-Klassen'!AC9","v":2},{"$f":"'[2]312 SO-Klassen'!AD9","v":2},{"$f":"'[2]312 SO-Klassen'!AE9","v":0},{"$f":"'[2]312 SO-Klassen'!AF9","v":3},{"$f":"'[2]312 SO-Klassen'!AG9","v":3},{"$f":"'[2]312 SO-Klassen'!AH9","v":0},{"$f":"'[2]312 SO-Klassen'!AI9","v":1},{"$f":"'[2]312 SO-Klassen'!AJ9","v":1},{"$f":"'[2]312 SO-Klassen'!AK9","v":0},{"$f":"'[2]312 SO-Klassen'!AL9","v":5},{"$f":"'[2]312 SO-Klassen'!AM9","v":5},{"$f":"'[2]312 SO-Klassen'!AN9","v":0},{"$f":"'[2]312 SO-Klassen'!AO9","v":0},{"$f":"'[2]312 SO-Klassen'!AP9","v":0},{"$f":"'[2]312 SO-Klassen'!AQ9","v":1},{"$f":"'[2]312 SO-Klassen'!AR9","v":0},{"$f":"'[2]312 SO-Klassen'!AS9","v":0},{"$f":"'[2]312 SO-Klassen'!AT9","v":0},{"$f":"'[2]312 SO-Klassen'!AU9","v":0},{"$f":"'[2]312 SO-Klassen'!AV9","v":0},{"$f":"'[2]312 SO-Klassen'!AW9","v":5},{"$f":"'[2]312 SO-Klassen'!AX9","v":0},{"$f":"'[2]312 SO-Klassen'!AY9","v":0},{"$f":"'[2]312 SO-Klassen'!AZ9","v":4},{"$f":"'[2]312 SO-Klassen'!BA9","v":1},{"$f":"'[2]312 SO-Klassen'!BB9","v":0},{"$f":"'[2]312 SO-Klassen'!BC9","v":1},{"$f":"'[2]312 SO-Klassen'!BD9","v":1},{"$f":"'[2]312 SO-Klassen'!BE9","v":0},{"$f":"'[2]312 SO-Klassen'!BF9","v":4},{"$f":"'[2]312 SO-Klassen'!BG9","v":0},{"$f":"'[2]312 SO-Klassen'!BH9","v":0},{"$f":"'[2]312 SO-Klassen'!BI9","v":1},{"$f":"'[2]312 SO-Klassen'!BJ9","v":1},{"$f":"'[2]312 SO-Klassen'!BK9","v":0},{"$f":"'[2]312 SO-Klassen'!BL9","v":0},{"$f":"'[2]312 SO-Klassen'!BM9","v":0},{"$f":"'[2]312 SO-Klassen'!BN9","v":0},{"$f":"'[2]312 SO-Klassen'!BO9","v":1},{"$f":"'[2]312 SO-Klassen'!BP9","v":0},{"$f":"'[2]312 SO-Klassen'!BQ9","v":0},{"$f":"'[2]312 SO-Klassen'!BR9","v":0},{"$f":"'[2]312 SO-Klassen'!BS9","v":0},{"$f":"'[2]312 SO-Klassen'!BT9","v":0},{"$f":"'[2]312 SO-Klassen'!BU9","v":0},{"$f":"'[2]312 SO-Klassen'!BV9","v":0},{"$f":"'[2]312 SO-Klassen'!BW9","v":0},{"$f":"'[2]312 SO-Klassen'!BX9","v":0},{"$f":"'[2]312 SO-Klassen'!BY9","v":0},{"$f":"'[2]312 SO-Klassen'!BZ9","v":0},{"$f":"'[2]312 SO-Klassen'!CA9","v":0},{"$f":"'[2]312 SO-Klassen'!CB9","v":1},{"$f":"'[2]312 SO-Klassen'!CC9","v":1},{"$f":"'[2]312 SO-Klassen'!CD9","v":4},{"$f":"'[2]312 SO-Klassen'!CE9","v":0},{"$f":"'[2]312 SO-Klassen'!CF9","v":0},{"$f":"'[2]312 SO-Klassen'!CG9","v":0},{"$f":"'[2]312 SO-Klassen'!CH9","v":1},{"$f":"'[2]312 SO-Klassen'!CI9","v":3},{"$f":"'[2]312 SO-Klassen'!CJ9","v":1},{"$f":"'[2]312 SO-Klassen'!CK9","v":2},{"$f":"'[2]312 SO-Klassen'!CL9","v":0},{"$f":"'[2]312 SO-Klassen'!CM9","v":0},{"$f":"'[2]312 SO-Klassen'!CN9","v":0},{"$f":"'[2]312 SO-Klassen'!CO9","v":0},{"$f":"'[2]312 SO-Klassen'!CP9","v":0},{"$f":"'[2]312 SO-Klassen'!CQ9","v":0},{"$f":"'[2]312 SO-Klassen'!CR9","v":0},{"$f":"'[2]312 SO-Klassen'!CS9","v":0},{"$f":"'[2]312 SO-Klassen'!CT9","v":0},{"$f":"'[2]312 SO-Klassen'!CU9","v":1},{"$f":"'[2]312 SO-Klassen'!CV9","v":0},{"$f":"'[2]312 SO-Klassen'!CW9","v":0},{"$f":"'[2]312 SO-Klassen'!CX9","v":0},{"$f":"'[2]312 SO-Klassen'!CY9","v":0},{"$f":"'[2]312 SO-Klassen'!CZ9","v":0},{"$f":"'[2]312 SO-Klassen'!DA9","v":0},{"$f":"'[2]312 SO-Klassen'!DB9","v":1},{"$f":"'[2]312 SO-Klassen'!DC9","v":0},{"$f":"'[2]312 SO-Klassen'!DD9","v":0},{"$f":"'[2]312 SO-Klassen'!DE9","v":2},{"$f":"'[2]312 SO-Klassen'!DF9","v":0},{"$f":"'[2]312 SO-Klassen'!DG9","v":0},{"$f":"'[2]312 SO-Klassen'!DH9","v":0},{"$f":"'[2]312 SO-Klassen'!DI9","v":0},{"$f":"'[2]312 SO-Klassen'!DJ9","v":0},{"$f":"'[2]312 SO-Klassen'!DK9","v":0},{"$f":"'[2]312 SO-Klassen'!DL9","v":0},{"$f":"'[2]312 SO-Klassen'!DM9","v":0},{"$f":"'[2]312 SO-Klassen'!DN9","v":0},{"$f":"'[2]312 SO-Klassen'!DO9","v":0},{"$f":"'[2]312 SO-Klassen'!DP9","v":0},{"$f":"'[2]312 SO-Klassen'!DQ9","v":0},{"$f":"'[2]312 SO-Klassen'!DR9","v":0},{"$f":"'[2]312 SO-Klassen'!DS9","v":0},{"$f":"'[2]312 SO-Klassen'!DT9","v":0},{"$f":"'[2]312 SO-Klassen'!DU9","v":0},{"$f":"'[2]312 SO-Klassen'!DV9","v":0},{"$f":"'[2]312 SO-Klassen'!DW9","v":0},{"$f":"'[2]312 SO-Klassen'!DX9","v":0},{"$f":"'[2]312 SO-Klassen'!DY9","v":0},{"$f":"'[2]312 SO-Klassen'!DZ9","v":0},{"$f":"'[2]312 SO-Klassen'!EA9","v":0},{"$f":"'[2]312 SO-Klassen'!EB9","v":0},{"$f":"'[2]312 SO-Klassen'!EC9","v":0},{"$f":"'[2]312 SO-Klassen'!ED9","v":0},{"$f":"'[2]312 SO-Klassen'!EE9","v":0},{"$f":"'[2]312 SO-Klassen'!EF9","v":0},{"$f":"'[2]312 SO-Klassen'!EG9","v":0},{"$f":"'[2]312 SO-Klassen'!EH9","v":0},{"$f":"'[2]312 SO-Klassen'!EI9","v":0},{"$f":"'[2]312 SO-Klassen'!EJ9","v":0},{"$f":"'[2]312 SO-Klassen'!EK9","v":0},{"$f":"'[2]312 SO-Klassen'!EL9","v":0},{"$f":"'[2]312 SO-Klassen'!EM9","v":501013},{"$f":"'[2]312 SO-Klassen'!EN9","v":44475},{"$f":"'[2]312 SO-Klassen'!EO9","v":"genehmigt"},{"$f":"'[2]312 SO-Klassen'!EP9","v":"2021-10-06"},{"$f":"'[2]312 SO-Klassen'!EQ9","v":0},{"$f":"'[2]312 SO-Klassen'!ER9","v":0},{"$f":"'[2]312 SO-Klassen'!ES9","v":0},{"$f":"'[2]312 SO-Klassen'!ET9","v":5},{"$f":"'[2]312 SO-Klassen'!EU9","v":0}]
[{"$f":"'[2]312 SO-Klassen'!B10","v":"2021/22"},{"$f":"'[2]312 SO-Klassen'!C10","v":"1"},{"$f":"'[2]312 SO-Klassen'!D10","v":"3"},{"$f":"'[2]312 SO-Klassen'!E10","v":501013},{"$f":"'[2]312 SO-Klassen'!F10","v":"SO Salzburg"},{"$f":"'[2]312 SO-Klassen'!G10","v":2},{"$f":"'[2]312 SO-Klassen'!H10","v":"2021-10-01"},{"$f":"'[2]312 SO-Klassen'!I10","v":3},{"$f":"'[2]312 SO-Klassen'!J10","v":"08"},{"$f":"'[2]312 SO-Klassen'!K10","v":"4MS1"},{"$f":"'[2]312 SO-Klassen'!L10","v":1},{"$f":"'[2]312 SO-Klassen'!M10","v":0},{"$f":"'[2]312 SO-Klassen'!N10","v":0},{"$f":"'[2]312 SO-Klassen'!O10","v":0},{"$f":"'[2]312 SO-Klassen'!P10","v":0},{"$f":"'[2]312 SO-Klassen'!Q10","v":0},{"$f":"'[2]312 SO-Klassen'!R10","v":1},{"$f":"'[2]312 SO-Klassen'!S10","v":0},{"$f":"'[2]312 SO-Klassen'!T10","v":0},{"$f":"'[2]312 SO-Klassen'!U10","v":0},{"$f":"'[2]312 SO-Klassen'!V10","v":0},{"$f":"'[2]312 SO-Klassen'!W10","v":0},{"$f":"'[2]312 SO-Klassen'!X10","v":0},{"$f":"'[2]312 SO-Klassen'!Y10","v":0},{"$f":"'[2]312 SO-Klassen'!Z10","v":0},{"$f":"'[2]312 SO-Klassen'!AA10","v":0},{"$f":"'[2]312 SO-Klassen'!AB10","v":0},{"$f":"'[2]312 SO-Klassen'!AC10","v":0},{"$f":"'[2]312 SO-Klassen'!AD10","v":0},{"$f":"'[2]312 SO-Klassen'!AE10","v":0},{"$f":"'[2]312 SO-Klassen'!AF10","v":0},{"$f":"'[2]312 SO-Klassen'!AG10","v":0},{"$f":"'[2]312 SO-Klassen'!AH10","v":0},{"$f":"'[2]312 SO-Klassen'!AI10","v":0},{"$f":"'[2]312 SO-Klassen'!AJ10","v":0},{"$f":"'[2]312 SO-Klassen'!AK10","v":0},{"$f":"'[2]312 SO-Klassen'!AL10","v":0},{"$f":"'[2]312 SO-Klassen'!AM10","v":0},{"$f":"'[2]312 SO-Klassen'!AN10","v":0},{"$f":"'[2]312 SO-Klassen'!AO10","v":0},{"$f":"'[2]312 SO-Klassen'!AP10","v":0},{"$f":"'[2]312 SO-Klassen'!AQ10","v":1},{"$f":"'[2]312 SO-Klassen'!AR10","v":10},{"$f":"'[2]312 SO-Klassen'!AS10","v":7},{"$f":"'[2]312 SO-Klassen'!AT10","v":0},{"$f":"'[2]312 SO-Klassen'!AU10","v":0},{"$f":"'[2]312 SO-Klassen'!AV10","v":0},{"$f":"'[2]312 SO-Klassen'!AW10","v":6},{"$f":"'[2]312 SO-Klassen'!AX10","v":0},{"$f":"'[2]312 SO-Klassen'!AY10","v":0},{"$f":"'[2]312 SO-Klassen'!AZ10","v":3},{"$f":"'[2]312 SO-Klassen'!BA10","v":2},{"$f":"'[2]312 SO-Klassen'!BB10","v":0},{"$f":"'[2]312 SO-Klassen'!BC10","v":0},{"$f":"'[2]312 SO-Klassen'!BD10","v":0},{"$f":"'[2]312 SO-Klassen'!BE10","v":0},{"$f":"'[2]312 SO-Klassen'!BF10","v":4},{"$f":"'[2]312 SO-Klassen'!BG10","v":1},{"$f":"'[2]312 SO-Klassen'!BH10","v":0},{"$f":"'[2]312 SO-Klassen'!BI10","v":0},{"$f":"'[2]312 SO-Klassen'!BJ10","v":0},{"$f":"'[2]312 SO-Klassen'!BK10","v":0},{"$f":"'[2]312 SO-Klassen'!BL10","v":0},{"$f":"'[2]312 SO-Klassen'!BM10","v":0},{"$f":"'[2]312 SO-Klassen'!BN10","v":0},{"$f":"'[2]312 SO-Klassen'!BO10","v":1},{"$f":"'[2]312 SO-Klassen'!BP10","v":0},{"$f":"'[2]312 SO-Klassen'!BQ10","v":0},{"$f":"'[2]312 SO-Klassen'!BR10","v":0},{"$f":"'[2]312 SO-Klassen'!BS10","v":0},{"$f":"'[2]312 SO-Klassen'!BT10","v":0},{"$f":"'[2]312 SO-Klassen'!BU10","v":0},{"$f":"'[2]312 SO-Klassen'!BV10","v":1},{"$f":"'[2]312 SO-Klassen'!BW10","v":0},{"$f":"'[2]312 SO-Klassen'!BX10","v":0},{"$f":"'[2]312 SO-Klassen'!BY10","v":0},{"$f":"'[2]312 SO-Klassen'!BZ10","v":0},{"$f":"'[2]312 SO-Klassen'!CA10","v":1},{"$f":"'[2]312 SO-Klassen'!CB10","v":2},{"$f":"'[2]312 SO-Klassen'!CC10","v":0},{"$f":"'[2]312 SO-Klassen'!CD10","v":0},{"$f":"'[2]312 SO-Klassen'!CE10","v":0},{"$f":"'[2]312 SO-Klassen'!CF10","v":0},{"$f":"'[2]312 SO-Klassen'!CG10","v":0},{"$f":"'[2]312 SO-Klassen'!CH10","v":0},{"$f":"'[2]312 SO-Klassen'!CI10","v":0},{"$f":"'[2]312 SO-Klassen'!CJ10","v":0},{"$f":"'[2]312 SO-Klassen'!CK10","v":0},{"$f":"'[2]312 SO-Klassen'!CL10","v":0},{"$f":"'[2]312 SO-Klassen'!CM10","v":5},{"$f":"'[2]312 SO-Klassen'!CN10","v":0},{"$f":"'[2]312 SO-Klassen'!CO10","v":0},{"$f":"'[2]312 SO-Klassen'!CP10","v":0},{"$f":"'[2]312 SO-Klassen'!CQ10","v":0},{"$f":"'[2]312 SO-Klassen'!CR10","v":0},{"$f":"'[2]312 SO-Klassen'!CS10","v":0},{"$f":"'[2]312 SO-Klassen'!CT10","v":0},{"$f":"'[2]312 SO-Klassen'!CU10","v":0},{"$f":"'[2]312 SO-Klassen'!CV10","v":0},{"$f":"'[2]312 SO-Klassen'!CW10","v":3},{"$f":"'[2]312 SO-Klassen'!CX10","v":0},{"$f":"'[2]312 SO-Klassen'!CY10","v":0},{"$f":"'[2]312 SO-Klassen'!CZ10","v":0},{"$f":"'[2]312 SO-Klassen'!DA10","v":0},{"$f":"'[2]312 SO-Klassen'!DB10","v":0},{"$f":"'[2]312 SO-Klassen'!DC10","v":0},{"$f":"'[2]312 SO-Klassen'!DD10","v":0},{"$f":"'[2]312 SO-Klassen'!DE10","v":0},{"$f":"'[2]312 SO-Klassen'!DF10","v":0},{"$f":"'[2]312 SO-Klassen'!DG10","v":0},{"$f":"'[2]312 SO-Klassen'!DH10","v":0},{"$f":"'[2]312 SO-Klassen'!DI10","v":0},{"$f":"'[2]312 SO-Klassen'!DJ10","v":0},{"$f":"'[2]312 SO-Klassen'!DK10","v":0},{"$f":"'[2]312 SO-Klassen'!DL10","v":0},{"$f":"'[2]312 SO-Klassen'!DM10","v":0},{"$f":"'[2]312 SO-Klassen'!DN10","v":0},{"$f":"'[2]312 SO-Klassen'!DO10","v":0},{"$f":"'[2]312 SO-Klassen'!DP10","v":0},{"$f":"'[2]312 SO-Klassen'!DQ10","v":0},{"$f":"'[2]312 SO-Klassen'!DR10","v":0},{"$f":"'[2]312 SO-Klassen'!DS10","v":0},{"$f":"'[2]312 SO-Klassen'!DT10","v":0},{"$f":"'[2]312 SO-Klassen'!DU10","v":0},{"$f":"'[2]312 SO-Klassen'!DV10","v":0},{"$f":"'[2]312 SO-Klassen'!DW10","v":0},{"$f":"'[2]312 SO-Klassen'!DX10","v":0},{"$f":"'[2]312 SO-Klassen'!DY10","v":0},{"$f":"'[2]312 SO-Klassen'!DZ10","v":0},{"$f":"'[2]312 SO-Klassen'!EA10","v":0},{"$f":"'[2]312 SO-Klassen'!EB10","v":0},{"$f":"'[2]312 SO-Klassen'!EC10","v":0},{"$f":"'[2]312 SO-Klassen'!ED10","v":0},{"$f":"'[2]312 SO-Klassen'!EE10","v":0},{"$f":"'[2]312 SO-Klassen'!EF10","v":0},{"$f":"'[2]312 SO-Klassen'!EG10","v":0},{"$f":"'[2]312 SO-Klassen'!EH10","v":0},{"$f":"'[2]312 SO-Klassen'!EI10","v":0},{"$f":"'[2]312 SO-Klassen'!EJ10","v":0},{"$f":"'[2]312 SO-Klassen'!EK10","v":0},{"$f":"'[2]312 SO-Klassen'!EL10","v":0},{"$f":"'[2]312 SO-Klassen'!EM10","v":501013},{"$f":"'[2]312 SO-Klassen'!EN10","v":44475},{"$f":"'[2]312 SO-Klassen'!EO10","v":"genehmigt"},{"$f":"'[2]312 SO-Klassen'!EP10","v":"2021-10-06"},{"$f":"'[2]312 SO-Klassen'!EQ10","v":1},{"$f":"'[2]312 SO-Klassen'!ER10","v":0},{"$f":"'[2]312 SO-Klassen'!ES10","v":0},{"$f":"'[2]312 SO-Klassen'!ET10","v":6},{"$f":"'[2]312 SO-Klassen'!EU10","v":0}]
[{"$f":"'[2]312 SO-Klassen'!B11","v":"2021/22"},{"$f":"'[2]312 SO-Klassen'!C11","v":"1"},{"$f":"'[2]312 SO-Klassen'!D11","v":"3"},{"$f":"'[2]312 SO-Klassen'!E11","v":501013},{"$f":"'[2]312 SO-Klassen'!F11","v":"SO Salzburg"},{"$f":"'[2]312 SO-Klassen'!G11","v":2},{"$f":"'[2]312 SO-Klassen'!H11","v":"2021-10-01"},{"$f":"'[2]312 SO-Klassen'!I11","v":3},{"$f":"'[2]312 SO-Klassen'!J11","v":"09"},{"$f":"'[2]312 SO-Klassen'!K11","v":"1bv1"},{"$f":"'[2]312 SO-Klassen'!L11","v":1},{"$f":"'[2]312 SO-Klassen'!M11","v":0},{"$f":"'[2]312 SO-Klassen'!N11","v":0},{"$f":"'[2]312 SO-Klassen'!O11","v":0},{"$f":"'[2]312 SO-Klassen'!P11","v":0},{"$f":"'[2]312 SO-Klassen'!Q11","v":0},{"$f":"'[2]312 SO-Klassen'!R11","v":1},{"$f":"'[2]312 SO-Klassen'!S11","v":0},{"$f":"'[2]312 SO-Klassen'!T11","v":0},{"$f":"'[2]312 SO-Klassen'!U11","v":0},{"$f":"'[2]312 SO-Klassen'!V11","v":0},{"$f":"'[2]312 SO-Klassen'!W11","v":0},{"$f":"'[2]312 SO-Klassen'!X11","v":0},{"$f":"'[2]312 SO-Klassen'!Y11","v":0},{"$f":"'[2]312 SO-Klassen'!Z11","v":0},{"$f":"'[2]312 SO-Klassen'!AA11","v":0},{"$f":"'[2]312 SO-Klassen'!AB11","v":0},{"$f":"'[2]312 SO-Klassen'!AC11","v":0},{"$f":"'[2]312 SO-Klassen'!AD11","v":0},{"$f":"'[2]312 SO-Klassen'!AE11","v":0},{"$f":"'[2]312 SO-Klassen'!AF11","v":0},{"$f":"'[2]312 SO-Klassen'!AG11","v":0},{"$f":"'[2]312 SO-Klassen'!AH11","v":0},{"$f":"'[2]312 SO-Klassen'!AI11","v":0},{"$f":"'[2]312 SO-Klassen'!AJ11","v":0},{"$f":"'[2]312 SO-Klassen'!AK11","v":0},{"$f":"'[2]312 SO-Klassen'!AL11","v":0},{"$f":"'[2]312 SO-Klassen'!AM11","v":0},{"$f":"'[2]312 SO-Klassen'!AN11","v":0},{"$f":"'[2]312 SO-Klassen'!AO11","v":0},{"$f":"'[2]312 SO-Klassen'!AP11","v":0},{"$f":"'[2]312 SO-Klassen'!AQ11","v":0},{"$f":"'[2]312 SO-Klassen'!AR11","v":0},{"$f":"'[2]312 SO-Klassen'!AS11","v":0},{"$f":"'[2]312 SO-Klassen'!AT11","v":1},{"$f":"'[2]312 SO-Klassen'!AU11","v":12},{"$f":"'[2]312 SO-Klassen'!AV11","v":12},{"$f":"'[2]312 SO-Klassen'!AW11","v":6},{"$f":"'[2]312 SO-Klassen'!AX11","v":0},{"$f":"'[2]312 SO-Klassen'!AY11","v":0},{"$f":"'[2]312 SO-Klassen'!AZ11","v":3},{"$f":"'[2]312 SO-Klassen'!BA11","v":2},{"$f":"'[2]312 SO-Klassen'!BB11","v":0},{"$f":"'[2]312 SO-Klassen'!BC11","v":2},{"$f":"'[2]312 SO-Klassen'!BD11","v":2},{"$f":"'[2]312 SO-Klassen'!BE11","v":0},{"$f":"'[2]312 SO-Klassen'!BF11","v":4},{"$f":"'[2]312 SO-Klassen'!BG11","v":4},{"$f":"'[2]312 SO-Klassen'!BH11","v":0},{"$f":"'[2]312 SO-Klassen'!BI11","v":0},{"$f":"'[2]312 SO-Klassen'!BJ11","v":0},{"$f":"'[2]312 SO-Klassen'!BK11","v":0},{"$f":"'[2]312 SO-Klassen'!BL11","v":0},{"$f":"'[2]312 SO-Klassen'!BM11","v":0},{"$f":"'[2]312 SO-Klassen'!BN11","v":0},{"$f":"'[2]312 SO-Klassen'!BO11","v":1},{"$f":"'[2]312 SO-Klassen'!BP11","v":0},{"$f":"'[2]312 SO-Klassen'!BQ11","v":0},{"$f":"'[2]312 SO-Klassen'!BR11","v":0},{"$f":"'[2]312 SO-Klassen'!BS11","v":0},{"$f":"'[2]312 SO-Klassen'!BT11","v":0},{"$f":"'[2]312 SO-Klassen'!BU11","v":0},{"$f":"'[2]312 SO-Klassen'!BV11","v":0},{"$f":"'[2]312 SO-Klassen'!BW11","v":0},{"$f":"'[2]312 SO-Klassen'!BX11","v":0},{"$f":"'[2]312 SO-Klassen'!BY11","v":0},{"$f":"'[2]312 SO-Klassen'!BZ11","v":0},{"$f":"'[2]312 SO-Klassen'!CA11","v":0},{"$f":"'[2]312 SO-Klassen'!CB11","v":0},{"$f":"'[2]312 SO-Klassen'!CC11","v":0},{"$f":"'[2]312 SO-Klassen'!CD11","v":0},{"$f":"'[2]312 SO-Klassen'!CE11","v":0},{"$f":"'[2]312 SO-Klassen'!CF11","v":0},{"$f":"'[2]312 SO-Klassen'!CG11","v":0},{"$f":"'[2]312 SO-Klassen'!CH11","v":0},{"$f":"'[2]312 SO-Klassen'!CI11","v":0},{"$f":"'[2]312 SO-Klassen'!CJ11","v":0},{"$f":"'[2]312 SO-Klassen'!CK11","v":0},{"$f":"'[2]312 SO-Klassen'!CL11","v":0},{"$f":"'[2]312 SO-Klassen'!CM11","v":0},{"$f":"'[2]312 SO-Klassen'!CN11","v":12},{"$f":"'[2]312 SO-Klassen'!CO11","v":0},{"$f":"'[2]312 SO-Klassen'!CP11","v":0},{"$f":"'[2]312 SO-Klassen'!CQ11","v":0},{"$f":"'[2]312 SO-Klassen'!CR11","v":0},{"$f":"'[2]312 SO-Klassen'!CS11","v":0},{"$f":"'[2]312 SO-Klassen'!CT11","v":0},{"$f":"'[2]312 SO-Klassen'!CU11","v":0},{"$f":"'[2]312 SO-Klassen'!CV11","v":0},{"$f":"'[2]312 SO-Klassen'!CW11","v":0},{"$f":"'[2]312 SO-Klassen'!CX11","v":0},{"$f":"'[2]312 SO-Klassen'!CY11","v":0},{"$f":"'[2]312 SO-Klassen'!CZ11","v":0},{"$f":"'[2]312 SO-Klassen'!DA11","v":0},{"$f":"'[2]312 SO-Klassen'!DB11","v":0},{"$f":"'[2]312 SO-Klassen'!DC11","v":0},{"$f":"'[2]312 SO-Klassen'!DD11","v":0},{"$f":"'[2]312 SO-Klassen'!DE11","v":0},{"$f":"'[2]312 SO-Klassen'!DF11","v":0},{"$f":"'[2]312 SO-Klassen'!DG11","v":0},{"$f":"'[2]312 SO-Klassen'!DH11","v":0},{"$f":"'[2]312 SO-Klassen'!DI11","v":0},{"$f":"'[2]312 SO-Klassen'!DJ11","v":0},{"$f":"'[2]312 SO-Klassen'!DK11","v":0},{"$f":"'[2]312 SO-Klassen'!DL11","v":0},{"$f":"'[2]312 SO-Klassen'!DM11","v":0},{"$f":"'[2]312 SO-Klassen'!DN11","v":0},{"$f":"'[2]312 SO-Klassen'!DO11","v":0},{"$f":"'[2]312 SO-Klassen'!DP11","v":0},{"$f":"'[2]312 SO-Klassen'!DQ11","v":0},{"$f":"'[2]312 SO-Klassen'!DR11","v":0},{"$f":"'[2]312 SO-Klassen'!DS11","v":0},{"$f":"'[2]312 SO-Klassen'!DT11","v":0},{"$f":"'[2]312 SO-Klassen'!DU11","v":0},{"$f":"'[2]312 SO-Klassen'!DV11","v":0},{"$f":"'[2]312 SO-Klassen'!DW11","v":0},{"$f":"'[2]312 SO-Klassen'!DX11","v":0},{"$f":"'[2]312 SO-Klassen'!DY11","v":0},{"$f":"'[2]312 SO-Klassen'!DZ11","v":0},{"$f":"'[2]312 SO-Klassen'!EA11","v":0},{"$f":"'[2]312 SO-Klassen'!EB11","v":0},{"$f":"'[2]312 SO-Klassen'!EC11","v":0},{"$f":"'[2]312 SO-Klassen'!ED11","v":0},{"$f":"'[2]312 SO-Klassen'!EE11","v":0},{"$f":"'[2]312 SO-Klassen'!EF11","v":0},{"$f":"'[2]312 SO-Klassen'!EG11","v":0},{"$f":"'[2]312 SO-Klassen'!EH11","v":0},{"$f":"'[2]312 SO-Klassen'!EI11","v":0},{"$f":"'[2]312 SO-Klassen'!EJ11","v":0},{"$f":"'[2]312 SO-Klassen'!EK11","v":0},{"$f":"'[2]312 SO-Klassen'!EL11","v":0},{"$f":"'[2]312 SO-Klassen'!EM11","v":501013},{"$f":"'[2]312 SO-Klassen'!EN11","v":44475},{"$f":"'[2]312 SO-Klassen'!EO11","v":"genehmigt"},{"$f":"'[2]312 SO-Klassen'!EP11","v":"2021-10-06"},{"$f":"'[2]312 SO-Klassen'!EQ11","v":0},{"$f":"'[2]312 SO-Klassen'!ER11","v":0},{"$f":"'[2]312 SO-Klassen'!ES11","v":0},{"$f":"'[2]312 SO-Klassen'!ET11","v":2},{"$f":"'[2]312 SO-Klassen'!EU11","v":0}]
[{"$f":"'[2]312 SO-Klassen'!B12","v":"2021/22"},{"$f":"'[2]312 SO-Klassen'!C12","v":"1"},{"$f":"'[2]312 SO-Klassen'!D12","v":"3"},{"$f":"'[2]312 SO-Klassen'!E12","v":501013},{"$f":"'[2]312 SO-Klassen'!F12","v":"SO Salzburg"},{"$f":"'[2]312 SO-Klassen'!G12","v":2},{"$f":"'[2]312 SO-Klassen'!H12","v":"2021-10-01"},{"$f":"'[2]312 SO-Klassen'!I12","v":3},{"$f":"'[2]312 SO-Klassen'!J12","v":"09"},{"$f":"'[2]312 SO-Klassen'!K12","v":"1bv2"},{"$f":"'[2]312 SO-Klassen'!L12","v":1},{"$f":"'[2]312 SO-Klassen'!M12","v":0},{"$f":"'[2]312 SO-Klassen'!N12","v":0},{"$f":"'[2]312 SO-Klassen'!O12","v":0},{"$f":"'[2]312 SO-Klassen'!P12","v":0},{"$f":"'[2]312 SO-Klassen'!Q12","v":0},{"$f":"'[2]312 SO-Klassen'!R12","v":1},{"$f":"'[2]312 SO-Klassen'!S12","v":0},{"$f":"'[2]312 SO-Klassen'!T12","v":0},{"$f":"'[2]312 SO-Klassen'!U12","v":0},{"$f":"'[2]312 SO-Klassen'!V12","v":0},{"$f":"'[2]312 SO-Klassen'!W12","v":0},{"$f":"'[2]312 SO-Klassen'!X12","v":0},{"$f":"'[2]312 SO-Klassen'!Y12","v":0},{"$f":"'[2]312 SO-Klassen'!Z12","v":0},{"$f":"'[2]312 SO-Klassen'!AA12","v":0},{"$f":"'[2]312 SO-Klassen'!AB12","v":0},{"$f":"'[2]312 SO-Klassen'!AC12","v":0},{"$f":"'[2]312 SO-Klassen'!AD12","v":0},{"$f":"'[2]312 SO-Klassen'!AE12","v":0},{"$f":"'[2]312 SO-Klassen'!AF12","v":0},{"$f":"'[2]312 SO-Klassen'!AG12","v":0},{"$f":"'[2]312 SO-Klassen'!AH12","v":0},{"$f":"'[2]312 SO-Klassen'!AI12","v":0},{"$f":"'[2]312 SO-Klassen'!AJ12","v":0},{"$f":"'[2]312 SO-Klassen'!AK12","v":0},{"$f":"'[2]312 SO-Klassen'!AL12","v":0},{"$f":"'[2]312 SO-Klassen'!AM12","v":0},{"$f":"'[2]312 SO-Klassen'!AN12","v":0},{"$f":"'[2]312 SO-Klassen'!AO12","v":0},{"$f":"'[2]312 SO-Klassen'!AP12","v":0},{"$f":"'[2]312 SO-Klassen'!AQ12","v":0},{"$f":"'[2]312 SO-Klassen'!AR12","v":1},{"$f":"'[2]312 SO-Klassen'!AS12","v":1},{"$f":"'[2]312 SO-Klassen'!AT12","v":1},{"$f":"'[2]312 SO-Klassen'!AU12","v":9},{"$f":"'[2]312 SO-Klassen'!AV12","v":9},{"$f":"'[2]312 SO-Klassen'!AW12","v":9},{"$f":"'[2]312 SO-Klassen'!AX12","v":0},{"$f":"'[2]312 SO-Klassen'!AY12","v":0},{"$f":"'[2]312 SO-Klassen'!AZ12","v":1},{"$f":"'[2]312 SO-Klassen'!BA12","v":1},{"$f":"'[2]312 SO-Klassen'!BB12","v":0},{"$f":"'[2]312 SO-Klassen'!BC12","v":0},{"$f":"'[2]312 SO-Klassen'!BD12","v":0},{"$f":"'[2]312 SO-Klassen'!BE12","v":0},{"$f":"'[2]312 SO-Klassen'!BF12","v":5},{"$f":"'[2]312 SO-Klassen'!BG12","v":4},{"$f":"'[2]312 SO-Klassen'!BH12","v":0},{"$f":"'[2]312 SO-Klassen'!BI12","v":2},{"$f":"'[2]312 SO-Klassen'!BJ12","v":2},{"$f":"'[2]312 SO-Klassen'!BK12","v":0},{"$f":"'[2]312 SO-Klassen'!BL12","v":0},{"$f":"'[2]312 SO-Klassen'!BM12","v":0},{"$f":"'[2]312 SO-Klassen'!BN12","v":0},{"$f":"'[2]312 SO-Klassen'!BO12","v":1},{"$f":"'[2]312 SO-Klassen'!BP12","v":0},{"$f":"'[2]312 SO-Klassen'!BQ12","v":0},{"$f":"'[2]312 SO-Klassen'!BR12","v":0},{"$f":"'[2]312 SO-Klassen'!BS12","v":0},{"$f":"'[2]312 SO-Klassen'!BT12","v":0},{"$f":"'[2]312 SO-Klassen'!BU12","v":0},{"$f":"'[2]312 SO-Klassen'!BV12","v":0},{"$f":"'[2]312 SO-Klassen'!BW12","v":0},{"$f":"'[2]312 SO-Klassen'!BX12","v":0},{"$f":"'[2]312 SO-Klassen'!BY12","v":1},{"$f":"'[2]312 SO-Klassen'!BZ12","v":0},{"$f":"'[2]312 SO-Klassen'!CA12","v":0},{"$f":"'[2]312 SO-Klassen'!CB12","v":0},{"$f":"'[2]312 SO-Klassen'!CC12","v":0},{"$f":"'[2]312 SO-Klassen'!CD12","v":0},{"$f":"'[2]312 SO-Klassen'!CE12","v":0},{"$f":"'[2]312 SO-Klassen'!CF12","v":0},{"$f":"'[2]312 SO-Klassen'!CG12","v":0},{"$f":"'[2]312 SO-Klassen'!CH12","v":0},{"$f":"'[2]312 SO-Klassen'!CI12","v":0},{"$f":"'[2]312 SO-Klassen'!CJ12","v":0},{"$f":"'[2]312 SO-Klassen'!CK12","v":0},{"$f":"'[2]312 SO-Klassen'!CL12","v":0},{"$f":"'[2]312 SO-Klassen'!CM12","v":0},{"$f":"'[2]312 SO-Klassen'!CN12","v":9},{"$f":"'[2]312 SO-Klassen'!CO12","v":0},{"$f":"'[2]312 SO-Klassen'!CP12","v":0},{"$f":"'[2]312 SO-Klassen'!CQ12","v":0},{"$f":"'[2]312 SO-Klassen'!CR12","v":0},{"$f":"'[2]312 SO-Klassen'!CS12","v":0},{"$f":"'[2]312 SO-Klassen'!CT12","v":0},{"$f":"'[2]312 SO-Klassen'!CU12","v":0},{"$f":"'[2]312 SO-Klassen'!CV12","v":0},{"$f":"'[2]312 SO-Klassen'!CW12","v":1},{"$f":"'[2]312 SO-Klassen'!CX12","v":0},{"$f":"'[2]312 SO-Klassen'!CY12","v":0},{"$f":"'[2]312 SO-Klassen'!CZ12","v":0},{"$f":"'[2]312 SO-Klassen'!DA12","v":0},{"$f":"'[2]312 SO-Klassen'!DB12","v":0},{"$f":"'[2]312 SO-Klassen'!DC12","v":0},{"$f":"'[2]312 SO-Klassen'!DD12","v":0},{"$f":"'[2]312 SO-Klassen'!DE12","v":0},{"$f":"'[2]312 SO-Klassen'!DF12","v":0},{"$f":"'[2]312 SO-Klassen'!DG12","v":0},{"$f":"'[2]312 SO-Klassen'!DH12","v":0},{"$f":"'[2]312 SO-Klassen'!DI12","v":0},{"$f":"'[2]312 SO-Klassen'!DJ12","v":0},{"$f":"'[2]312 SO-Klassen'!DK12","v":0},{"$f":"'[2]312 SO-Klassen'!DL12","v":0},{"$f":"'[2]312 SO-Klassen'!DM12","v":0},{"$f":"'[2]312 SO-Klassen'!DN12","v":0},{"$f":"'[2]312 SO-Klassen'!DO12","v":0},{"$f":"'[2]312 SO-Klassen'!DP12","v":0},{"$f":"'[2]312 SO-Klassen'!DQ12","v":0},{"$f":"'[2]312 SO-Klassen'!DR12","v":0},{"$f":"'[2]312 SO-Klassen'!DS12","v":0},{"$f":"'[2]312 SO-Klassen'!DT12","v":0},{"$f":"'[2]312 SO-Klassen'!DU12","v":0},{"$f":"'[2]312 SO-Klassen'!DV12","v":0},{"$f":"'[2]312 SO-Klassen'!DW12","v":0},{"$f":"'[2]312 SO-Klassen'!DX12","v":0},{"$f":"'[2]312 SO-Klassen'!DY12","v":0},{"$f":"'[2]312 SO-Klassen'!DZ12","v":0},{"$f":"'[2]312 SO-Klassen'!EA12","v":0},{"$f":"'[2]312 SO-Klassen'!EB12","v":0},{"$f":"'[2]312 SO-Klassen'!EC12","v":0},{"$f":"'[2]312 SO-Klassen'!ED12","v":0},{"$f":"'[2]312 SO-Klassen'!EE12","v":0},{"$f":"'[2]312 SO-Klassen'!EF12","v":0},{"$f":"'[2]312 SO-Klassen'!EG12","v":0},{"$f":"'[2]312 SO-Klassen'!EH12","v":0},{"$f":"'[2]312 SO-Klassen'!EI12","v":0},{"$f":"'[2]312 SO-Klassen'!EJ12","v":0},{"$f":"'[2]312 SO-Klassen'!EK12","v":0},{"$f":"'[2]312 SO-Klassen'!EL12","v":0},{"$f":"'[2]312 SO-Klassen'!EM12","v":501013},{"$f":"'[2]312 SO-Klassen'!EN12","v":44475},{"$f":"'[2]312 SO-Klassen'!EO12","v":"genehmigt"},{"$f":"'[2]312 SO-Klassen'!EP12","v":"2021-10-06"},{"$f":"'[2]312 SO-Klassen'!EQ12","v":0},{"$f":"'[2]312 SO-Klassen'!ER12","v":0},{"$f":"'[2]312 SO-Klassen'!ES12","v":0},{"$f":"'[2]312 SO-Klassen'!ET12","v":7},{"$f":"'[2]312 SO-Klassen'!EU12","v":0}]
[{"$f":"'[2]312 SO-Klassen'!B13","v":"2021/22"},{"$f":"'[2]312 SO-Klassen'!C13","v":"1"},{"$f":"'[2]312 SO-Klassen'!D13","v":"3"},{"$f":"'[2]312 SO-Klassen'!E13","v":501013},{"$f":"'[2]312 SO-Klassen'!F13","v":"SO Salzburg"},{"$f":"'[2]312 SO-Klassen'!G13","v":2},{"$f":"'[2]312 SO-Klassen'!H13","v":"2021-10-01"},{"$f":"'[2]312 SO-Klassen'!I13","v":3},{"$f":"'[2]312 SO-Klassen'!J13","v":"09"},{"$f":"'[2]312 SO-Klassen'!K13","v":"1bv3"},{"$f":"'[2]312 SO-Klassen'!L13","v":1},{"$f":"'[2]312 SO-Klassen'!M13","v":0},{"$f":"'[2]312 SO-Klassen'!N13","v":0},{"$f":"'[2]312 SO-Klassen'!O13","v":0},{"$f":"'[2]312 SO-Klassen'!P13","v":0},{"$f":"'[2]312 SO-Klassen'!Q13","v":0},{"$f":"'[2]312 SO-Klassen'!R13","v":1},{"$f":"'[2]312 SO-Klassen'!S13","v":0},{"$f":"'[2]312 SO-Klassen'!T13","v":0},{"$f":"'[2]312 SO-Klassen'!U13","v":0},{"$f":"'[2]312 SO-Klassen'!V13","v":0},{"$f":"'[2]312 SO-Klassen'!W13","v":0},{"$f":"'[2]312 SO-Klassen'!X13","v":0},{"$f":"'[2]312 SO-Klassen'!Y13","v":0},{"$f":"'[2]312 SO-Klassen'!Z13","v":0},{"$f":"'[2]312 SO-Klassen'!AA13","v":0},{"$f":"'[2]312 SO-Klassen'!AB13","v":0},{"$f":"'[2]312 SO-Klassen'!AC13","v":0},{"$f":"'[2]312 SO-Klassen'!AD13","v":0},{"$f":"'[2]312 SO-Klassen'!AE13","v":0},{"$f":"'[2]312 SO-Klassen'!AF13","v":0},{"$f":"'[2]312 SO-Klassen'!AG13","v":0},{"$f":"'[2]312 SO-Klassen'!AH13","v":0},{"$f":"'[2]312 SO-Klassen'!AI13","v":0},{"$f":"'[2]312 SO-Klassen'!AJ13","v":0},{"$f":"'[2]312 SO-Klassen'!AK13","v":0},{"$f":"'[2]312 SO-Klassen'!AL13","v":0},{"$f":"'[2]312 SO-Klassen'!AM13","v":0},{"$f":"'[2]312 SO-Klassen'!AN13","v":0},{"$f":"'[2]312 SO-Klassen'!AO13","v":0},{"$f":"'[2]312 SO-Klassen'!AP13","v":0},{"$f":"'[2]312 SO-Klassen'!AQ13","v":0},{"$f":"'[2]312 SO-Klassen'!AR13","v":3},{"$f":"'[2]312 SO-Klassen'!AS13","v":3},{"$f":"'[2]312 SO-Klassen'!AT13","v":1},{"$f":"'[2]312 SO-Klassen'!AU13","v":8},{"$f":"'[2]312 SO-Klassen'!AV13","v":8},{"$f":"'[2]312 SO-Klassen'!AW13","v":9},{"$f":"'[2]312 SO-Klassen'!AX13","v":0},{"$f":"'[2]312 SO-Klassen'!AY13","v":0},{"$f":"'[2]312 SO-Klassen'!AZ13","v":1},{"$f":"'[2]312 SO-Klassen'!BA13","v":1},{"$f":"'[2]312 SO-Klassen'!BB13","v":0},{"$f":"'[2]312 SO-Klassen'!BC13","v":0},{"$f":"'[2]312 SO-Klassen'!BD13","v":0},{"$f":"'[2]312 SO-Klassen'!BE13","v":0},{"$f":"'[2]312 SO-Klassen'!BF13","v":8},{"$f":"'[2]312 SO-Klassen'!BG13","v":8},{"$f":"'[2]312 SO-Klassen'!BH13","v":0},{"$f":"'[2]312 SO-Klassen'!BI13","v":0},{"$f":"'[2]312 SO-Klassen'!BJ13","v":0},{"$f":"'[2]312 SO-Klassen'!BK13","v":0},{"$f":"'[2]312 SO-Klassen'!BL13","v":0},{"$f":"'[2]312 SO-Klassen'!BM13","v":0},{"$f":"'[2]312 SO-Klassen'!BN13","v":0},{"$f":"'[2]312 SO-Klassen'!BO13","v":1},{"$f":"'[2]312 SO-Klassen'!BP13","v":0},{"$f":"'[2]312 SO-Klassen'!BQ13","v":0},{"$f":"'[2]312 SO-Klassen'!BR13","v":0},{"$f":"'[2]312 SO-Klassen'!BS13","v":0},{"$f":"'[2]312 SO-Klassen'!BT13","v":0},{"$f":"'[2]312 SO-Klassen'!BU13","v":0},{"$f":"'[2]312 SO-Klassen'!BV13","v":0},{"$f":"'[2]312 SO-Klassen'!BW13","v":0},{"$f":"'[2]312 SO-Klassen'!BX13","v":0},{"$f":"'[2]312 SO-Klassen'!BY13","v":0},{"$f":"'[2]312 SO-Klassen'!BZ13","v":0},{"$f":"'[2]312 SO-Klassen'!CA13","v":0},{"$f":"'[2]312 SO-Klassen'!CB13","v":0},{"$f":"'[2]312 SO-Klassen'!CC13","v":0},{"$f":"'[2]312 SO-Klassen'!CD13","v":0},{"$f":"'[2]312 SO-Klassen'!CE13","v":0},{"$f":"'[2]312 SO-Klassen'!CF13","v":0},{"$f":"'[2]312 SO-Klassen'!CG13","v":0},{"$f":"'[2]312 SO-Klassen'!CH13","v":0},{"$f":"'[2]312 SO-Klassen'!CI13","v":0},{"$f":"'[2]312 SO-Klassen'!CJ13","v":0},{"$f":"'[2]312 SO-Klassen'!CK13","v":0},{"$f":"'[2]312 SO-Klassen'!CL13","v":0},{"$f":"'[2]312 SO-Klassen'!CM13","v":3},{"$f":"'[2]312 SO-Klassen'!CN13","v":8},{"$f":"'[2]312 SO-Klassen'!CO13","v":0},{"$f":"'[2]312 SO-Klassen'!CP13","v":0},{"$f":"'[2]312 SO-Klassen'!CQ13","v":0},{"$f":"'[2]312 SO-Klassen'!CR13","v":0},{"$f":"'[2]312 SO-Klassen'!CS13","v":0},{"$f":"'[2]312 SO-Klassen'!CT13","v":0},{"$f":"'[2]312 SO-Klassen'!CU13","v":0},{"$f":"'[2]312 SO-Klassen'!CV13","v":0},{"$f":"'[2]312 SO-Klassen'!CW13","v":0},{"$f":"'[2]312 SO-Klassen'!CX13","v":0},{"$f":"'[2]312 SO-Klassen'!CY13","v":0},{"$f":"'[2]312 SO-Klassen'!CZ13","v":0},{"$f":"'[2]312 SO-Klassen'!DA13","v":0},{"$f":"'[2]312 SO-Klassen'!DB13","v":0},{"$f":"'[2]312 SO-Klassen'!DC13","v":0},{"$f":"'[2]312 SO-Klassen'!DD13","v":0},{"$f":"'[2]312 SO-Klassen'!DE13","v":0},{"$f":"'[2]312 SO-Klassen'!DF13","v":0},{"$f":"'[2]312 SO-Klassen'!DG13","v":0},{"$f":"'[2]312 SO-Klassen'!DH13","v":0},{"$f":"'[2]312 SO-Klassen'!DI13","v":0},{"$f":"'[2]312 SO-Klassen'!DJ13","v":0},{"$f":"'[2]312 SO-Klassen'!DK13","v":0},{"$f":"'[2]312 SO-Klassen'!DL13","v":0},{"$f":"'[2]312 SO-Klassen'!DM13","v":0},{"$f":"'[2]312 SO-Klassen'!DN13","v":0},{"$f":"'[2]312 SO-Klassen'!DO13","v":0},{"$f":"'[2]312 SO-Klassen'!DP13","v":0},{"$f":"'[2]312 SO-Klassen'!DQ13","v":0},{"$f":"'[2]312 SO-Klassen'!DR13","v":0},{"$f":"'[2]312 SO-Klassen'!DS13","v":0},{"$f":"'[2]312 SO-Klassen'!DT13","v":0},{"$f":"'[2]312 SO-Klassen'!DU13","v":0},{"$f":"'[2]312 SO-Klassen'!DV13","v":0},{"$f":"'[2]312 SO-Klassen'!DW13","v":0},{"$f":"'[2]312 SO-Klassen'!DX13","v":0},{"$f":"'[2]312 SO-Klassen'!DY13","v":0},{"$f":"'[2]312 SO-Klassen'!DZ13","v":0},{"$f":"'[2]312 SO-Klassen'!EA13","v":0},{"$f":"'[2]312 SO-Klassen'!EB13","v":0},{"$f":"'[2]312 SO-Klassen'!EC13","v":0},{"$f":"'[2]312 SO-Klassen'!ED13","v":0},{"$f":"'[2]312 SO-Klassen'!EE13","v":0},{"$f":"'[2]312 SO-Klassen'!EF13","v":0},{"$f":"'[2]312 SO-Klassen'!EG13","v":0},{"$f":"'[2]312 SO-Klassen'!EH13","v":0},{"$f":"'[2]312 SO-Klassen'!EI13","v":0},{"$f":"'[2]312 SO-Klassen'!EJ13","v":0},{"$f":"'[2]312 SO-Klassen'!EK13","v":0},{"$f":"'[2]312 SO-Klassen'!EL13","v":0},{"$f":"'[2]312 SO-Klassen'!EM13","v":501013},{"$f":"'[2]312 SO-Klassen'!EN13","v":44475},{"$f":"'[2]312 SO-Klassen'!EO13","v":"genehmigt"},{"$f":"'[2]312 SO-Klassen'!EP13","v":"2021-10-06"},{"$f":"'[2]312 SO-Klassen'!EQ13","v":0},{"$f":"'[2]312 SO-Klassen'!ER13","v":0},{"$f":"'[2]312 SO-Klassen'!ES13","v":0},{"$f":"'[2]312 SO-Klassen'!ET13","v":8},{"$f":"'[2]312 SO-Klassen'!EU13","v":0}]
[{"$f":"'[2]312 SO-Klassen'!B14","v":"2021/22"},{"$f":"'[2]312 SO-Klassen'!C14","v":"1"},{"$f":"'[2]312 SO-Klassen'!D14","v":"3"},{"$f":"'[2]312 SO-Klassen'!E14","v":501013},{"$f":"'[2]312 SO-Klassen'!F14","v":"SO Salzburg"},{"$f":"'[2]312 SO-Klassen'!G14","v":2},{"$f":"'[2]312 SO-Klassen'!H14","v":"2021-10-01"},{"$f":"'[2]312 SO-Klassen'!I14","v":3},{"$f":"'[2]312 SO-Klassen'!J14","v":"09"},{"$f":"'[2]312 SO-Klassen'!K14","v":"1bv4"},{"$f":"'[2]312 SO-Klassen'!L14","v":0},{"$f":"'[2]312 SO-Klassen'!M14","v":0},{"$f":"'[2]312 SO-Klassen'!N14","v":0},{"$f":"'[2]312 SO-Klassen'!O14","v":1},{"$f":"'[2]312 SO-Klassen'!P14","v":0},{"$f":"'[2]312 SO-Klassen'!Q14","v":0},{"$f":"'[2]312 SO-Klassen'!R14","v":1},{"$f":"'[2]312 SO-Klassen'!S14","v":0},{"$f":"'[2]312 SO-Klassen'!T14","v":0},{"$f":"'[2]312 SO-Klassen'!U14","v":0},{"$f":"'[2]312 SO-Klassen'!V14","v":0},{"$f":"'[2]312 SO-Klassen'!W14","v":0},{"$f":"'[2]312 SO-Klassen'!X14","v":0},{"$f":"'[2]312 SO-Klassen'!Y14","v":0},{"$f":"'[2]312 SO-Klassen'!Z14","v":0},{"$f":"'[2]312 SO-Klassen'!AA14","v":0},{"$f":"'[2]312 SO-Klassen'!AB14","v":0},{"$f":"'[2]312 SO-Klassen'!AC14","v":0},{"$f":"'[2]312 SO-Klassen'!AD14","v":0},{"$f":"'[2]312 SO-Klassen'!AE14","v":0},{"$f":"'[2]312 SO-Klassen'!AF14","v":0},{"$f":"'[2]312 SO-Klassen'!AG14","v":0},{"$f":"'[2]312 SO-Klassen'!AH14","v":0},{"$f":"'[2]312 SO-Klassen'!AI14","v":0},{"$f":"'[2]312 SO-Klassen'!AJ14","v":0},{"$f":"'[2]312 SO-Klassen'!AK14","v":0},{"$f":"'[2]312 SO-Klassen'!AL14","v":0},{"$f":"'[2]312 SO-Klassen'!AM14","v":0},{"$f":"'[2]312 SO-Klassen'!AN14","v":0},{"$f":"'[2]312 SO-Klassen'!AO14","v":0},{"$f":"'[2]312 SO-Klassen'!AP14","v":0},{"$f":"'[2]312 SO-Klassen'!AQ14","v":0},{"$f":"'[2]312 SO-Klassen'!AR14","v":4},{"$f":"'[2]312 SO-Klassen'!AS14","v":4},{"$f":"'[2]312 SO-Klassen'!AT14","v":1},{"$f":"'[2]312 SO-Klassen'!AU14","v":4},{"$f":"'[2]312 SO-Klassen'!AV14","v":4},{"$f":"'[2]312 SO-Klassen'!AW14","v":6},{"$f":"'[2]312 SO-Klassen'!AX14","v":0},{"$f":"'[2]312 SO-Klassen'!AY14","v":0},{"$f":"'[2]312 SO-Klassen'!AZ14","v":1},{"$f":"'[2]312 SO-Klassen'!BA14","v":0},{"$f":"'[2]312 SO-Klassen'!BB14","v":0},{"$f":"'[2]312 SO-Klassen'!BC14","v":0},{"$f":"'[2]312 SO-Klassen'!BD14","v":0},{"$f":"'[2]312 SO-Klassen'!BE14","v":0},{"$f":"'[2]312 SO-Klassen'!BF14","v":3},{"$f":"'[2]312 SO-Klassen'!BG14","v":2},{"$f":"'[2]312 SO-Klassen'!BH14","v":0},{"$f":"'[2]312 SO-Klassen'!BI14","v":2},{"$f":"'[2]312 SO-Klassen'!BJ14","v":2},{"$f":"'[2]312 SO-Klassen'!BK14","v":0},{"$f":"'[2]312 SO-Klassen'!BL14","v":0},{"$f":"'[2]312 SO-Klassen'!BM14","v":0},{"$f":"'[2]312 SO-Klassen'!BN14","v":0},{"$f":"'[2]312 SO-Klassen'!BO14","v":1},{"$f":"'[2]312 SO-Klassen'!BP14","v":0},{"$f":"'[2]312 SO-Klassen'!BQ14","v":0},{"$f":"'[2]312 SO-Klassen'!BR14","v":0},{"$f":"'[2]312 SO-Klassen'!BS14","v":0},{"$f":"'[2]312 SO-Klassen'!BT14","v":0},{"$f":"'[2]312 SO-Klassen'!BU14","v":0},{"$f":"'[2]312 SO-Klassen'!BV14","v":0},{"$f":"'[2]312 SO-Klassen'!BW14","v":1},{"$f":"'[2]312 SO-Klassen'!BX14","v":0},{"$f":"'[2]312 SO-Klassen'!BY14","v":0},{"$f":"'[2]312 SO-Klassen'!BZ14","v":0},{"$f":"'[2]312 SO-Klassen'!CA14","v":0},{"$f":"'[2]312 SO-Klassen'!CB14","v":0},{"$f":"'[2]312 SO-Klassen'!CC14","v":0},{"$f":"'[2]312 SO-Klassen'!CD14","v":1},{"$f":"'[2]312 SO-Klassen'!CE14","v":0},{"$f":"'[2]312 SO-Klassen'!CF14","v":0},{"$f":"'[2]312 SO-Klassen'!CG14","v":0},{"$f":"'[2]312 SO-Klassen'!CH14","v":0},{"$f":"'[2]312 SO-Klassen'!CI14","v":0},{"$f":"'[2]312 SO-Klassen'!CJ14","v":0},{"$f":"'[2]312 SO-Klassen'!CK14","v":0},{"$f":"'[2]312 SO-Klassen'!CL14","v":0},{"$f":"'[2]312 SO-Klassen'!CM14","v":0},{"$f":"'[2]312 SO-Klassen'!CN14","v":0},{"$f":"'[2]312 SO-Klassen'!CO14","v":0},{"$f":"'[2]312 SO-Klassen'!CP14","v":0},{"$f":"'[2]312 SO-Klassen'!CQ14","v":0},{"$f":"'[2]312 SO-Klassen'!CR14","v":0},{"$f":"'[2]312 SO-Klassen'!CS14","v":0},{"$f":"'[2]312 SO-Klassen'!CT14","v":0},{"$f":"'[2]312 SO-Klassen'!CU14","v":0},{"$f":"'[2]312 SO-Klassen'!CV14","v":0},{"$f":"'[2]312 SO-Klassen'!CW14","v":0},{"$f":"'[2]312 SO-Klassen'!CX14","v":0},{"$f":"'[2]312 SO-Klassen'!CY14","v":0},{"$f":"'[2]312 SO-Klassen'!CZ14","v":0},{"$f":"'[2]312 SO-Klassen'!DA14","v":0},{"$f":"'[2]312 SO-Klassen'!DB14","v":0},{"$f":"'[2]312 SO-Klassen'!DC14","v":0},{"$f":"'[2]312 SO-Klassen'!DD14","v":0},{"$f":"'[2]312 SO-Klassen'!DE14","v":0},{"$f":"'[2]312 SO-Klassen'!DF14","v":0},{"$f":"'[2]312 SO-Klassen'!DG14","v":4},{"$f":"'[2]312 SO-Klassen'!DH14","v":4},{"$f":"'[2]312 SO-Klassen'!DI14","v":0},{"$f":"'[2]312 SO-Klassen'!DJ14","v":0},{"$f":"'[2]312 SO-Klassen'!DK14","v":0},{"$f":"'[2]312 SO-Klassen'!DL14","v":0},{"$f":"'[2]312 SO-Klassen'!DM14","v":0},{"$f":"'[2]312 SO-Klassen'!DN14","v":0},{"$f":"'[2]312 SO-Klassen'!DO14","v":0},{"$f":"'[2]312 SO-Klassen'!DP14","v":0},{"$f":"'[2]312 SO-Klassen'!DQ14","v":0},{"$f":"'[2]312 SO-Klassen'!DR14","v":0},{"$f":"'[2]312 SO-Klassen'!DS14","v":0},{"$f":"'[2]312 SO-Klassen'!DT14","v":0},{"$f":"'[2]312 SO-Klassen'!DU14","v":0},{"$f":"'[2]312 SO-Klassen'!DV14","v":0},{"$f":"'[2]312 SO-Klassen'!DW14","v":0},{"$f":"'[2]312 SO-Klassen'!DX14","v":0},{"$f":"'[2]312 SO-Klassen'!DY14","v":0},{"$f":"'[2]312 SO-Klassen'!DZ14","v":0},{"$f":"'[2]312 SO-Klassen'!EA14","v":0},{"$f":"'[2]312 SO-Klassen'!EB14","v":0},{"$f":"'[2]312 SO-Klassen'!EC14","v":0},{"$f":"'[2]312 SO-Klassen'!ED14","v":0},{"$f":"'[2]312 SO-Klassen'!EE14","v":0},{"$f":"'[2]312 SO-Klassen'!EF14","v":0},{"$f":"'[2]312 SO-Klassen'!EG14","v":0},{"$f":"'[2]312 SO-Klassen'!EH14","v":0},{"$f":"'[2]312 SO-Klassen'!EI14","v":0},{"$f":"'[2]312 SO-Klassen'!EJ14","v":0},{"$f":"'[2]312 SO-Klassen'!EK14","v":0},{"$f":"'[2]312 SO-Klassen'!EL14","v":0},{"$f":"'[2]312 SO-Klassen'!EM14","v":501013},{"$f":"'[2]312 SO-Klassen'!EN14","v":44475},{"$f":"'[2]312 SO-Klassen'!EO14","v":"genehmigt"},{"$f":"'[2]312 SO-Klassen'!EP14","v":"2021-10-06"},{"$f":"'[2]312 SO-Klassen'!EQ14","v":0},{"$f":"'[2]312 SO-Klassen'!ER14","v":0},{"$f":"'[2]312 SO-Klassen'!ES14","v":0},{"$f":"'[2]312 SO-Klassen'!ET14","v":6},{"$f":"'[2]312 SO-Klassen'!EU14","v":0}]
[{"$f":"'[2]312 SO-Klassen'!B15","v":"2021/22"},{"$f":"'[2]312 SO-Klassen'!C15","v":"1"},{"$f":"'[2]312 SO-Klassen'!D15","v":"3"},{"$f":"'[2]312 SO-Klassen'!E15","v":501013},{"$f":"'[2]312 SO-Klassen'!F15","v":"SO Salzburg"},{"$f":"'[2]312 SO-Klassen'!G15","v":2},{"$f":"'[2]312 SO-Klassen'!H15","v":"2021-10-01"},{"$f":"'[2]312 SO-Klassen'!I15","v":3},{"$f":"'[2]312 SO-Klassen'!J15","v":"09"},{"$f":"'[2]312 SO-Klassen'!K15","v":"1bv5"},{"$f":"'[2]312 SO-Klassen'!L15","v":0},{"$f":"'[2]312 SO-Klassen'!M15","v":0},{"$f":"'[2]312 SO-Klassen'!N15","v":0},{"$f":"'[2]312 SO-Klassen'!O15","v":1},{"$f":"'[2]312 SO-Klassen'!P15","v":0},{"$f":"'[2]312 SO-Klassen'!Q15","v":0},{"$f":"'[2]312 SO-Klassen'!R15","v":1},{"$f":"'[2]312 SO-Klassen'!S15","v":0},{"$f":"'[2]312 SO-Klassen'!T15","v":0},{"$f":"'[2]312 SO-Klassen'!U15","v":0},{"$f":"'[2]312 SO-Klassen'!V15","v":0},{"$f":"'[2]312 SO-Klassen'!W15","v":0},{"$f":"'[2]312 SO-Klassen'!X15","v":0},{"$f":"'[2]312 SO-Klassen'!Y15","v":0},{"$f":"'[2]312 SO-Klassen'!Z15","v":0},{"$f":"'[2]312 SO-Klassen'!AA15","v":0},{"$f":"'[2]312 SO-Klassen'!AB15","v":0},{"$f":"'[2]312 SO-Klassen'!AC15","v":0},{"$f":"'[2]312 SO-Klassen'!AD15","v":0},{"$f":"'[2]312 SO-Klassen'!AE15","v":0},{"$f":"'[2]312 SO-Klassen'!AF15","v":0},{"$f":"'[2]312 SO-Klassen'!AG15","v":0},{"$f":"'[2]312 SO-Klassen'!AH15","v":0},{"$f":"'[2]312 SO-Klassen'!AI15","v":0},{"$f":"'[2]312 SO-Klassen'!AJ15","v":0},{"$f":"'[2]312 SO-Klassen'!AK15","v":0},{"$f":"'[2]312 SO-Klassen'!AL15","v":0},{"$f":"'[2]312 SO-Klassen'!AM15","v":0},{"$f":"'[2]312 SO-Klassen'!AN15","v":0},{"$f":"'[2]312 SO-Klassen'!AO15","v":0},{"$f":"'[2]312 SO-Klassen'!AP15","v":0},{"$f":"'[2]312 SO-Klassen'!AQ15","v":0},{"$f":"'[2]312 SO-Klassen'!AR15","v":1},{"$f":"'[2]312 SO-Klassen'!AS15","v":1},{"$f":"'[2]312 SO-Klassen'!AT15","v":1},{"$f":"'[2]312 SO-Klassen'!AU15","v":6},{"$f":"'[2]312 SO-Klassen'!AV15","v":6},{"$f":"'[2]312 SO-Klassen'!AW15","v":6},{"$f":"'[2]312 SO-Klassen'!AX15","v":0},{"$f":"'[2]312 SO-Klassen'!AY15","v":0},{"$f":"'[2]312 SO-Klassen'!AZ15","v":2},{"$f":"'[2]312 SO-Klassen'!BA15","v":0},{"$f":"'[2]312 SO-Klassen'!BB15","v":0},{"$f":"'[2]312 SO-Klassen'!BC15","v":0},{"$f":"'[2]312 SO-Klassen'!BD15","v":0},{"$f":"'[2]312 SO-Klassen'!BE15","v":0},{"$f":"'[2]312 SO-Klassen'!BF15","v":4},{"$f":"'[2]312 SO-Klassen'!BG15","v":3},{"$f":"'[2]312 SO-Klassen'!BH15","v":0},{"$f":"'[2]312 SO-Klassen'!BI15","v":1},{"$f":"'[2]312 SO-Klassen'!BJ15","v":1},{"$f":"'[2]312 SO-Klassen'!BK15","v":0},{"$f":"'[2]312 SO-Klassen'!BL15","v":0},{"$f":"'[2]312 SO-Klassen'!BM15","v":0},{"$f":"'[2]312 SO-Klassen'!BN15","v":0},{"$f":"'[2]312 SO-Klassen'!BO15","v":1},{"$f":"'[2]312 SO-Klassen'!BP15","v":0},{"$f":"'[2]312 SO-Klassen'!BQ15","v":0},{"$f":"'[2]312 SO-Klassen'!BR15","v":0},{"$f":"'[2]312 SO-Klassen'!BS15","v":0},{"$f":"'[2]312 SO-Klassen'!BT15","v":0},{"$f":"'[2]312 SO-Klassen'!BU15","v":0},{"$f":"'[2]312 SO-Klassen'!BV15","v":1},{"$f":"'[2]312 SO-Klassen'!BW15","v":0},{"$f":"'[2]312 SO-Klassen'!BX15","v":0},{"$f":"'[2]312 SO-Klassen'!BY15","v":0},{"$f":"'[2]312 SO-Klassen'!BZ15","v":0},{"$f":"'[2]312 SO-Klassen'!CA15","v":0},{"$f":"'[2]312 SO-Klassen'!CB15","v":0},{"$f":"'[2]312 SO-Klassen'!CC15","v":3},{"$f":"'[2]312 SO-Klassen'!CD15","v":3},{"$f":"'[2]312 SO-Klassen'!CE15","v":0},{"$f":"'[2]312 SO-Klassen'!CF15","v":0},{"$f":"'[2]312 SO-Klassen'!CG15","v":0},{"$f":"'[2]312 SO-Klassen'!CH15","v":0},{"$f":"'[2]312 SO-Klassen'!CI15","v":0},{"$f":"'[2]312 SO-Klassen'!CJ15","v":0},{"$f":"'[2]312 SO-Klassen'!CK15","v":0},{"$f":"'[2]312 SO-Klassen'!CL15","v":0},{"$f":"'[2]312 SO-Klassen'!CM15","v":0},{"$f":"'[2]312 SO-Klassen'!CN15","v":0},{"$f":"'[2]312 SO-Klassen'!CO15","v":0},{"$f":"'[2]312 SO-Klassen'!CP15","v":0},{"$f":"'[2]312 SO-Klassen'!CQ15","v":0},{"$f":"'[2]312 SO-Klassen'!CR15","v":0},{"$f":"'[2]312 SO-Klassen'!CS15","v":0},{"$f":"'[2]312 SO-Klassen'!CT15","v":0},{"$f":"'[2]312 SO-Klassen'!CU15","v":0},{"$f":"'[2]312 SO-Klassen'!CV15","v":0},{"$f":"'[2]312 SO-Klassen'!CW15","v":0},{"$f":"'[2]312 SO-Klassen'!CX15","v":0},{"$f":"'[2]312 SO-Klassen'!CY15","v":0},{"$f":"'[2]312 SO-Klassen'!CZ15","v":0},{"$f":"'[2]312 SO-Klassen'!DA15","v":0},{"$f":"'[2]312 SO-Klassen'!DB15","v":0},{"$f":"'[2]312 SO-Klassen'!DC15","v":0},{"$f":"'[2]312 SO-Klassen'!DD15","v":0},{"$f":"'[2]312 SO-Klassen'!DE15","v":0},{"$f":"'[2]312 SO-Klassen'!DF15","v":0},{"$f":"'[2]312 SO-Klassen'!DG15","v":1},{"$f":"'[2]312 SO-Klassen'!DH15","v":6},{"$f":"'[2]312 SO-Klassen'!DI15","v":0},{"$f":"'[2]312 SO-Klassen'!DJ15","v":0},{"$f":"'[2]312 SO-Klassen'!DK15","v":0},{"$f":"'[2]312 SO-Klassen'!DL15","v":0},{"$f":"'[2]312 SO-Klassen'!DM15","v":0},{"$f":"'[2]312 SO-Klassen'!DN15","v":0},{"$f":"'[2]312 SO-Klassen'!DO15","v":0},{"$f":"'[2]312 SO-Klassen'!DP15","v":0},{"$f":"'[2]312 SO-Klassen'!DQ15","v":0},{"$f":"'[2]312 SO-Klassen'!DR15","v":0},{"$f":"'[2]312 SO-Klassen'!DS15","v":0},{"$f":"'[2]312 SO-Klassen'!DT15","v":0},{"$f":"'[2]312 SO-Klassen'!DU15","v":0},{"$f":"'[2]312 SO-Klassen'!DV15","v":0},{"$f":"'[2]312 SO-Klassen'!DW15","v":0},{"$f":"'[2]312 SO-Klassen'!DX15","v":0},{"$f":"'[2]312 SO-Klassen'!DY15","v":0},{"$f":"'[2]312 SO-Klassen'!DZ15","v":0},{"$f":"'[2]312 SO-Klassen'!EA15","v":0},{"$f":"'[2]312 SO-Klassen'!EB15","v":0},{"$f":"'[2]312 SO-Klassen'!EC15","v":0},{"$f":"'[2]312 SO-Klassen'!ED15","v":0},{"$f":"'[2]312 SO-Klassen'!EE15","v":0},{"$f":"'[2]312 SO-Klassen'!EF15","v":0},{"$f":"'[2]312 SO-Klassen'!EG15","v":0},{"$f":"'[2]312 SO-Klassen'!EH15","v":0},{"$f":"'[2]312 SO-Klassen'!EI15","v":0},{"$f":"'[2]312 SO-Klassen'!EJ15","v":0},{"$f":"'[2]312 SO-Klassen'!EK15","v":0},{"$f":"'[2]312 SO-Klassen'!EL15","v":0},{"$f":"'[2]312 SO-Klassen'!EM15","v":501013},{"$f":"'[2]312 SO-Klassen'!EN15","v":44475},{"$f":"'[2]312 SO-Klassen'!EO15","v":"genehmigt"},{"$f":"'[2]312 SO-Klassen'!EP15","v":"2021-10-06"},{"$f":"'[2]312 SO-Klassen'!EQ15","v":0},{"$f":"'[2]312 SO-Klassen'!ER15","v":0},{"$f":"'[2]312 SO-Klassen'!ES15","v":0},{"$f":"'[2]312 SO-Klassen'!ET15","v":5},{"$f":"'[2]312 SO-Klassen'!EU15","v":0}]
[{"$f":"'[2]312 SO-Klassen'!B16","v":"2021/22"},{"$f":"'[2]312 SO-Klassen'!C16","v":"1"},{"$f":"'[2]312 SO-Klassen'!D16","v":"3"},{"$f":"'[2]312 SO-Klassen'!E16","v":501013},{"$f":"'[2]312 SO-Klassen'!F16","v":"SO Salzburg"},{"$f":"'[2]312 SO-Klassen'!G16","v":2},{"$f":"'[2]312 SO-Klassen'!H16","v":"2000-01-01"},{"$f":"'[2]312 SO-Klassen'!I16","v":3},{"$f":"'[2]312 SO-Klassen'!J16","v":"99"},{"$f":"'[2]312 SO-Klassen'!K16","v":"X"},{"$f":"'[2]312 SO-Klassen'!L16","v":0},{"$f":"'[2]312 SO-Klassen'!M16","v":0},{"$f":"'[2]312 SO-Klassen'!N16","v":0},{"$f":"'[2]312 SO-Klassen'!O16","v":0},{"$f":"'[2]312 SO-Klassen'!P16","v":0},{"$f":"'[2]312 SO-Klassen'!Q16","v":0},{"$f":"'[2]312 SO-Klassen'!R16","v":1},{"$f":"'[2]312 SO-Klassen'!S16","v":0},{"$f":"'[2]312 SO-Klassen'!T16","v":""},{"$f":"'[2]312 SO-Klassen'!U16","v":""},{"$f":"'[2]312 SO-Klassen'!V16","v":0},{"$f":"'[2]312 SO-Klassen'!W16","v":""},{"$f":"'[2]312 SO-Klassen'!X16","v":""},{"$f":"'[2]312 SO-Klassen'!Y16","v":0},{"$f":"'[2]312 SO-Klassen'!Z16","v":""},{"$f":"'[2]312 SO-Klassen'!AA16","v":""},{"$f":"'[2]312 SO-Klassen'!AB16","v":0},{"$f":"'[2]312 SO-Klassen'!AC16","v":""},{"$f":"'[2]312 SO-Klassen'!AD16","v":""},{"$f":"'[2]312 SO-Klassen'!AE16","v":0},{"$f":"'[2]312 SO-Klassen'!AF16","v":""},{"$f":"'[2]312 SO-Klassen'!AG16","v":""},{"$f":"'[2]312 SO-Klassen'!AH16","v":0},{"$f":"'[2]312 SO-Klassen'!AI16","v":""},{"$f":"'[2]312 SO-Klassen'!AJ16","v":""},{"$f":"'[2]312 SO-Klassen'!AK16","v":0},{"$f":"'[2]312 SO-Klassen'!AL16","v":""},{"$f":"'[2]312 SO-Klassen'!AM16","v":""},{"$f":"'[2]312 SO-Klassen'!AN16","v":0},{"$f":"'[2]312 SO-Klassen'!AO16","v":""},{"$f":"'[2]312 SO-Klassen'!AP16","v":""},{"$f":"'[2]312 SO-Klassen'!AQ16","v":0},{"$f":"'[2]312 SO-Klassen'!AR16","v":""},{"$f":"'[2]312 SO-Klassen'!AS16","v":""},{"$f":"'[2]312 SO-Klassen'!AT16","v":0},{"$f":"'[2]312 SO-Klassen'!AU16","v":""},{"$f":"'[2]312 SO-Klassen'!AV16","v":""},{"$f":"'[2]312 SO-Klassen'!AW16","v":""},{"$f":"'[2]312 SO-Klassen'!AX16","v":""},{"$f":"'[2]312 SO-Klassen'!AY16","v":""},{"$f":"'[2]312 SO-Klassen'!AZ16","v":""},{"$f":"'[2]312 SO-Klassen'!BA16","v":""},{"$f":"'[2]312 SO-Klassen'!BB16","v":""},{"$f":"'[2]312 SO-Klassen'!BC16","v":""},{"$f":"'[2]312 SO-Klassen'!BD16","v":""},{"$f":"'[2]312 SO-Klassen'!BE16","v":""},{"$f":"'[2]312 SO-Klassen'!BF16","v":""},{"$f":"'[2]312 SO-Klassen'!BG16","v":""},{"$f":"'[2]312 SO-Klassen'!BH16","v":""},{"$f":"'[2]312 SO-Klassen'!BI16","v":""},{"$f":"'[2]312 SO-Klassen'!BJ16","v":""},{"$f":"'[2]312 SO-Klassen'!BK16","v":""},{"$f":"'[2]312 SO-Klassen'!BL16","v":""},{"$f":"'[2]312 SO-Klassen'!BM16","v":""},{"$f":"'[2]312 SO-Klassen'!BN16","v":""},{"$f":"'[2]312 SO-Klassen'!BO16","v":""},{"$f":"'[2]312 SO-Klassen'!BP16","v":0},{"$f":"'[2]312 SO-Klassen'!BQ16","v":0},{"$f":"'[2]312 SO-Klassen'!BR16","v":0},{"$f":"'[2]312 SO-Klassen'!BS16","v":0},{"$f":"'[2]312 SO-Klassen'!BT16","v":0},{"$f":"'[2]312 SO-Klassen'!BU16","v":0},{"$f":"'[2]312 SO-Klassen'!BV16","v":0},{"$f":"'[2]312 SO-Klassen'!BW16","v":0},{"$f":"'[2]312 SO-Klassen'!BX16","v":0},{"$f":"'[2]312 SO-Klassen'!BY16","v":0},{"$f":"'[2]312 SO-Klassen'!BZ16","v":""},{"$f":"'[2]312 SO-Klassen'!CA16","v":""},{"$f":"'[2]312 SO-Klassen'!CB16","v":""},{"$f":"'[2]312 SO-Klassen'!CC16","v":""},{"$f":"'[2]312 SO-Klassen'!CD16","v":""},{"$f":"'[2]312 SO-Klassen'!CE16","v":""},{"$f":"'[2]312 SO-Klassen'!CF16","v":""},{"$f":"'[2]312 SO-Klassen'!CG16","v":""},{"$f":"'[2]312 SO-Klassen'!CH16","v":""},{"$f":"'[2]312 SO-Klassen'!CI16","v":""},{"$f":"'[2]312 SO-Klassen'!CJ16","v":""},{"$f":"'[2]312 SO-Klassen'!CK16","v":""},{"$f":"'[2]312 SO-Klassen'!CL16","v":""},{"$f":"'[2]312 SO-Klassen'!CM16","v":""},{"$f":"'[2]312 SO-Klassen'!CN16","v":""},{"$f":"'[2]312 SO-Klassen'!CO16","v":""},{"$f":"'[2]312 SO-Klassen'!CP16","v":""},{"$f":"'[2]312 SO-Klassen'!CQ16","v":""},{"$f":"'[2]312 SO-Klassen'!CR16","v":""},{"$f":"'[2]312 SO-Klassen'!CS16","v":""},{"$f":"'[2]312 SO-Klassen'!CT16","v":""},{"$f":"'[2]312 SO-Klassen'!CU16","v":""},{"$f":"'[2]312 SO-Klassen'!CV16","v":""},{"$f":"'[2]312 SO-Klassen'!CW16","v":""},{"$f":"'[2]312 SO-Klassen'!CX16","v":""},{"$f":"'[2]312 SO-Klassen'!CY16","v":""},{"$f":"'[2]312 SO-Klassen'!CZ16","v":""},{"$f":"'[2]312 SO-Klassen'!DA16","v":""},{"$f":"'[2]312 SO-Klassen'!DB16","v":""},{"$f":"'[2]312 SO-Klassen'!DC16","v":""},{"$f":"'[2]312 SO-Klassen'!DD16","v":""},{"$f":"'[2]312 SO-Klassen'!DE16","v":""},{"$f":"'[2]312 SO-Klassen'!DF16","v":""},{"$f":"'[2]312 SO-Klassen'!DG16","v":""},{"$f":"'[2]312 SO-Klassen'!DH16","v":""},{"$f":"'[2]312 SO-Klassen'!DI16","v":""},{"$f":"'[2]312 SO-Klassen'!DJ16","v":""},{"$f":"'[2]312 SO-Klassen'!DK16","v":""},{"$f":"'[2]312 SO-Klassen'!DL16","v":""},{"$f":"'[2]312 SO-Klassen'!DM16","v":""},{"$f":"'[2]312 SO-Klassen'!DN16","v":""},{"$f":"'[2]312 SO-Klassen'!DO16","v":""},{"$f":"'[2]312 SO-Klassen'!DP16","v":""},{"$f":"'[2]312 SO-Klassen'!DQ16","v":""},{"$f":"'[2]312 SO-Klassen'!DR16","v":""},{"$f":"'[2]312 SO-Klassen'!DS16","v":""},{"$f":"'[2]312 SO-Klassen'!DT16","v":""},{"$f":"'[2]312 SO-Klassen'!DU16","v":""},{"$f":"'[2]312 SO-Klassen'!DV16","v":""},{"$f":"'[2]312 SO-Klassen'!DW16","v":""},{"$f":"'[2]312 SO-Klassen'!DX16","v":""},{"$f":"'[2]312 SO-Klassen'!DY16","v":""},{"$f":"'[2]312 SO-Klassen'!DZ16","v":""},{"$f":"'[2]312 SO-Klassen'!EA16","v":""},{"$f":"'[2]312 SO-Klassen'!EB16","v":""},{"$f":"'[2]312 SO-Klassen'!EC16","v":""},{"$f":"'[2]312 SO-Klassen'!ED16","v":""},{"$f":"'[2]312 SO-Klassen'!EE16","v":""},{"$f":"'[2]312 SO-Klassen'!EF16","v":""},{"$f":"'[2]312 SO-Klassen'!EG16","v":""},{"$f":"'[2]312 SO-Klassen'!EH16","v":""},{"$f":"'[2]312 SO-Klassen'!EI16","v":""},{"$f":"'[2]312 SO-Klassen'!EJ16","v":""},{"$f":"'[2]312 SO-Klassen'!EK16","v":""},{"$f":"'[2]312 SO-Klassen'!EL16","v":""},{"$f":"'[2]312 SO-Klassen'!EM16","v":501013},{"$f":"'[2]312 SO-Klassen'!EN16","v":44475},{"$f":"'[2]312 SO-Klassen'!EO16","v":"genehmigt"},{"$f":"'[2]312 SO-Klassen'!EP16","v":"2021-10-06"},{"$f":"'[2]312 SO-Klassen'!EQ16","v":""},{"$f":"'[2]312 SO-Klassen'!ER16","v":""},{"$f":"'[2]312 SO-Klassen'!ES16","v":""},{"$f":"'[2]312 SO-Klassen'!ET16","v":""},{"$f":"'[2]312 SO-Klassen'!EU16","v":""}]
[{"$f":"'[2]312 SO-Klassen'!B17","v":"2021/22"},{"$f":"'[2]312 SO-Klassen'!C17","v":"1"},{"$f":"'[2]312 SO-Klassen'!D17","v":"3"},{"$f":"'[2]312 SO-Klassen'!E17","v":501013},{"$f":"'[2]312 SO-Klassen'!F17","v":"SO Salzburg"},{"$f":"'[2]312 SO-Klassen'!G17","v":2},{"$f":"'[2]312 SO-Klassen'!H17","v":"2000-01-01"},{"$f":"'[2]312 SO-Klassen'!I17","v":3},{"$f":"'[2]312 SO-Klassen'!J17","v":"99"},{"$f":"'[2]312 SO-Klassen'!K17","v":"X"},{"$f":"'[2]312 SO-Klassen'!L17","v":0},{"$f":"'[2]312 SO-Klassen'!M17","v":0},{"$f":"'[2]312 SO-Klassen'!N17","v":0},{"$f":"'[2]312 SO-Klassen'!O17","v":0},{"$f":"'[2]312 SO-Klassen'!P17","v":0},{"$f":"'[2]312 SO-Klassen'!Q17","v":0},{"$f":"'[2]312 SO-Klassen'!R17","v":1},{"$f":"'[2]312 SO-Klassen'!S17","v":0},{"$f":"'[2]312 SO-Klassen'!T17","v":""},{"$f":"'[2]312 SO-Klassen'!U17","v":""},{"$f":"'[2]312 SO-Klassen'!V17","v":0},{"$f":"'[2]312 SO-Klassen'!W17","v":""},{"$f":"'[2]312 SO-Klassen'!X17","v":""},{"$f":"'[2]312 SO-Klassen'!Y17","v":0},{"$f":"'[2]312 SO-Klassen'!Z17","v":""},{"$f":"'[2]312 SO-Klassen'!AA17","v":""},{"$f":"'[2]312 SO-Klassen'!AB17","v":0},{"$f":"'[2]312 SO-Klassen'!AC17","v":""},{"$f":"'[2]312 SO-Klassen'!AD17","v":""},{"$f":"'[2]312 SO-Klassen'!AE17","v":0},{"$f":"'[2]312 SO-Klassen'!AF17","v":""},{"$f":"'[2]312 SO-Klassen'!AG17","v":""},{"$f":"'[2]312 SO-Klassen'!AH17","v":0},{"$f":"'[2]312 SO-Klassen'!AI17","v":""},{"$f":"'[2]312 SO-Klassen'!AJ17","v":""},{"$f":"'[2]312 SO-Klassen'!AK17","v":0},{"$f":"'[2]312 SO-Klassen'!AL17","v":""},{"$f":"'[2]312 SO-Klassen'!AM17","v":""},{"$f":"'[2]312 SO-Klassen'!AN17","v":0},{"$f":"'[2]312 SO-Klassen'!AO17","v":""},{"$f":"'[2]312 SO-Klassen'!AP17","v":""},{"$f":"'[2]312 SO-Klassen'!AQ17","v":0},{"$f":"'[2]312 SO-Klassen'!AR17","v":""},{"$f":"'[2]312 SO-Klassen'!AS17","v":""},{"$f":"'[2]312 SO-Klassen'!AT17","v":0},{"$f":"'[2]312 SO-Klassen'!AU17","v":""},{"$f":"'[2]312 SO-Klassen'!AV17","v":""},{"$f":"'[2]312 SO-Klassen'!AW17","v":""},{"$f":"'[2]312 SO-Klassen'!AX17","v":""},{"$f":"'[2]312 SO-Klassen'!AY17","v":""},{"$f":"'[2]312 SO-Klassen'!AZ17","v":""},{"$f":"'[2]312 SO-Klassen'!BA17","v":""},{"$f":"'[2]312 SO-Klassen'!BB17","v":""},{"$f":"'[2]312 SO-Klassen'!BC17","v":""},{"$f":"'[2]312 SO-Klassen'!BD17","v":""},{"$f":"'[2]312 SO-Klassen'!BE17","v":""},{"$f":"'[2]312 SO-Klassen'!BF17","v":""},{"$f":"'[2]312 SO-Klassen'!BG17","v":""},{"$f":"'[2]312 SO-Klassen'!BH17","v":""},{"$f":"'[2]312 SO-Klassen'!BI17","v":""},{"$f":"'[2]312 SO-Klassen'!BJ17","v":""},{"$f":"'[2]312 SO-Klassen'!BK17","v":""},{"$f":"'[2]312 SO-Klassen'!BL17","v":""},{"$f":"'[2]312 SO-Klassen'!BM17","v":""},{"$f":"'[2]312 SO-Klassen'!BN17","v":""},{"$f":"'[2]312 SO-Klassen'!BO17","v":""},{"$f":"'[2]312 SO-Klassen'!BP17","v":0},{"$f":"'[2]312 SO-Klassen'!BQ17","v":0},{"$f":"'[2]312 SO-Klassen'!BR17","v":0},{"$f":"'[2]312 SO-Klassen'!BS17","v":0},{"$f":"'[2]312 SO-Klassen'!BT17","v":0},{"$f":"'[2]312 SO-Klassen'!BU17","v":0},{"$f":"'[2]312 SO-Klassen'!BV17","v":0},{"$f":"'[2]312 SO-Klassen'!BW17","v":0},{"$f":"'[2]312 SO-Klassen'!BX17","v":0},{"$f":"'[2]312 SO-Klassen'!BY17","v":0},{"$f":"'[2]312 SO-Klassen'!BZ17","v":""},{"$f":"'[2]312 SO-Klassen'!CA17","v":""},{"$f":"'[2]312 SO-Klassen'!CB17","v":""},{"$f":"'[2]312 SO-Klassen'!CC17","v":""},{"$f":"'[2]312 SO-Klassen'!CD17","v":""},{"$f":"'[2]312 SO-Klassen'!CE17","v":""},{"$f":"'[2]312 SO-Klassen'!CF17","v":""},{"$f":"'[2]312 SO-Klassen'!CG17","v":""},{"$f":"'[2]312 SO-Klassen'!CH17","v":""},{"$f":"'[2]312 SO-Klassen'!CI17","v":""},{"$f":"'[2]312 SO-Klassen'!CJ17","v":""},{"$f":"'[2]312 SO-Klassen'!CK17","v":""},{"$f":"'[2]312 SO-Klassen'!CL17","v":""},{"$f":"'[2]312 SO-Klassen'!CM17","v":""},{"$f":"'[2]312 SO-Klassen'!CN17","v":""},{"$f":"'[2]312 SO-Klassen'!CO17","v":""},{"$f":"'[2]312 SO-Klassen'!CP17","v":""},{"$f":"'[2]312 SO-Klassen'!CQ17","v":""},{"$f":"'[2]312 SO-Klassen'!CR17","v":""},{"$f":"'[2]312 SO-Klassen'!CS17","v":""},{"$f":"'[2]312 SO-Klassen'!CT17","v":""},{"$f":"'[2]312 SO-Klassen'!CU17","v":""},{"$f":"'[2]312 SO-Klassen'!CV17","v":""},{"$f":"'[2]312 SO-Klassen'!CW17","v":""},{"$f":"'[2]312 SO-Klassen'!CX17","v":""},{"$f":"'[2]312 SO-Klassen'!CY17","v":""},{"$f":"'[2]312 SO-Klassen'!CZ17","v":""},{"$f":"'[2]312 SO-Klassen'!DA17","v":""},{"$f":"'[2]312 SO-Klassen'!DB17","v":""},{"$f":"'[2]312 SO-Klassen'!DC17","v":""},{"$f":"'[2]312 SO-Klassen'!DD17","v":""},{"$f":"'[2]312 SO-Klassen'!DE17","v":""},{"$f":"'[2]312 SO-Klassen'!DF17","v":""},{"$f":"'[2]312 SO-Klassen'!DG17","v":""},{"$f":"'[2]312 SO-Klassen'!DH17","v":""},{"$f":"'[2]312 SO-Klassen'!DI17","v":""},{"$f":"'[2]312 SO-Klassen'!DJ17","v":""},{"$f":"'[2]312 SO-Klassen'!DK17","v":""},{"$f":"'[2]312 SO-Klassen'!DL17","v":""},{"$f":"'[2]312 SO-Klassen'!DM17","v":""},{"$f":"'[2]312 SO-Klassen'!DN17","v":""},{"$f":"'[2]312 SO-Klassen'!DO17","v":""},{"$f":"'[2]312 SO-Klassen'!DP17","v":""},{"$f":"'[2]312 SO-Klassen'!DQ17","v":""},{"$f":"'[2]312 SO-Klassen'!DR17","v":""},{"$f":"'[2]312 SO-Klassen'!DS17","v":""},{"$f":"'[2]312 SO-Klassen'!DT17","v":""},{"$f":"'[2]312 SO-Klassen'!DU17","v":""},{"$f":"'[2]312 SO-Klassen'!DV17","v":""},{"$f":"'[2]312 SO-Klassen'!DW17","v":""},{"$f":"'[2]312 SO-Klassen'!DX17","v":""},{"$f":"'[2]312 SO-Klassen'!DY17","v":""},{"$f":"'[2]312 SO-Klassen'!DZ17","v":""},{"$f":"'[2]312 SO-Klassen'!EA17","v":""},{"$f":"'[2]312 SO-Klassen'!EB17","v":""},{"$f":"'[2]312 SO-Klassen'!EC17","v":""},{"$f":"'[2]312 SO-Klassen'!ED17","v":""},{"$f":"'[2]312 SO-Klassen'!EE17","v":""},{"$f":"'[2]312 SO-Klassen'!EF17","v":""},{"$f":"'[2]312 SO-Klassen'!EG17","v":""},{"$f":"'[2]312 SO-Klassen'!EH17","v":""},{"$f":"'[2]312 SO-Klassen'!EI17","v":""},{"$f":"'[2]312 SO-Klassen'!EJ17","v":""},{"$f":"'[2]312 SO-Klassen'!EK17","v":""},{"$f":"'[2]312 SO-Klassen'!EL17","v":""},{"$f":"'[2]312 SO-Klassen'!EM17","v":501013},{"$f":"'[2]312 SO-Klassen'!EN17","v":44475},{"$f":"'[2]312 SO-Klassen'!EO17","v":"genehmigt"},{"$f":"'[2]312 SO-Klassen'!EP17","v":"2021-10-06"},{"$f":"'[2]312 SO-Klassen'!EQ17","v":""},{"$f":"'[2]312 SO-Klassen'!ER17","v":""},{"$f":"'[2]312 SO-Klassen'!ES17","v":""},{"$f":"'[2]312 SO-Klassen'!ET17","v":""},{"$f":"'[2]312 SO-Klassen'!EU17","v":""}]
[{"$f":"'[2]312 SO-Klassen'!B18","v":"2021/22"},{"$f":"'[2]312 SO-Klassen'!C18","v":"1"},{"$f":"'[2]312 SO-Klassen'!D18","v":"3"},{"$f":"'[2]312 SO-Klassen'!E18","v":501013},{"$f":"'[2]312 SO-Klassen'!F18","v":"SO Salzburg"},{"$f":"'[2]312 SO-Klassen'!G18","v":2},{"$f":"'[2]312 SO-Klassen'!H18","v":"2000-01-01"},{"$f":"'[2]312 SO-Klassen'!I18","v":3},{"$f":"'[2]312 SO-Klassen'!J18","v":"99"},{"$f":"'[2]312 SO-Klassen'!K18","v":"X"},{"$f":"'[2]312 SO-Klassen'!L18","v":0},{"$f":"'[2]312 SO-Klassen'!M18","v":0},{"$f":"'[2]312 SO-Klassen'!N18","v":0},{"$f":"'[2]312 SO-Klassen'!O18","v":0},{"$f":"'[2]312 SO-Klassen'!P18","v":0},{"$f":"'[2]312 SO-Klassen'!Q18","v":0},{"$f":"'[2]312 SO-Klassen'!R18","v":1},{"$f":"'[2]312 SO-Klassen'!S18","v":0},{"$f":"'[2]312 SO-Klassen'!T18","v":""},{"$f":"'[2]312 SO-Klassen'!U18","v":""},{"$f":"'[2]312 SO-Klassen'!V18","v":0},{"$f":"'[2]312 SO-Klassen'!W18","v":""},{"$f":"'[2]312 SO-Klassen'!X18","v":""},{"$f":"'[2]312 SO-Klassen'!Y18","v":0},{"$f":"'[2]312 SO-Klassen'!Z18","v":""},{"$f":"'[2]312 SO-Klassen'!AA18","v":""},{"$f":"'[2]312 SO-Klassen'!AB18","v":0},{"$f":"'[2]312 SO-Klassen'!AC18","v":""},{"$f":"'[2]312 SO-Klassen'!AD18","v":""},{"$f":"'[2]312 SO-Klassen'!AE18","v":0},{"$f":"'[2]312 SO-Klassen'!AF18","v":""},{"$f":"'[2]312 SO-Klassen'!AG18","v":""},{"$f":"'[2]312 SO-Klassen'!AH18","v":0},{"$f":"'[2]312 SO-Klassen'!AI18","v":""},{"$f":"'[2]312 SO-Klassen'!AJ18","v":""},{"$f":"'[2]312 SO-Klassen'!AK18","v":0},{"$f":"'[2]312 SO-Klassen'!AL18","v":""},{"$f":"'[2]312 SO-Klassen'!AM18","v":""},{"$f":"'[2]312 SO-Klassen'!AN18","v":0},{"$f":"'[2]312 SO-Klassen'!AO18","v":""},{"$f":"'[2]312 SO-Klassen'!AP18","v":""},{"$f":"'[2]312 SO-Klassen'!AQ18","v":0},{"$f":"'[2]312 SO-Klassen'!AR18","v":""},{"$f":"'[2]312 SO-Klassen'!AS18","v":""},{"$f":"'[2]312 SO-Klassen'!AT18","v":0},{"$f":"'[2]312 SO-Klassen'!AU18","v":""},{"$f":"'[2]312 SO-Klassen'!AV18","v":""},{"$f":"'[2]312 SO-Klassen'!AW18","v":""},{"$f":"'[2]312 SO-Klassen'!AX18","v":""},{"$f":"'[2]312 SO-Klassen'!AY18","v":""},{"$f":"'[2]312 SO-Klassen'!AZ18","v":""},{"$f":"'[2]312 SO-Klassen'!BA18","v":""},{"$f":"'[2]312 SO-Klassen'!BB18","v":""},{"$f":"'[2]312 SO-Klassen'!BC18","v":""},{"$f":"'[2]312 SO-Klassen'!BD18","v":""},{"$f":"'[2]312 SO-Klassen'!BE18","v":""},{"$f":"'[2]312 SO-Klassen'!BF18","v":""},{"$f":"'[2]312 SO-Klassen'!BG18","v":""},{"$f":"'[2]312 SO-Klassen'!BH18","v":""},{"$f":"'[2]312 SO-Klassen'!BI18","v":""},{"$f":"'[2]312 SO-Klassen'!BJ18","v":""},{"$f":"'[2]312 SO-Klassen'!BK18","v":""},{"$f":"'[2]312 SO-Klassen'!BL18","v":""},{"$f":"'[2]312 SO-Klassen'!BM18","v":""},{"$f":"'[2]312 SO-Klassen'!BN18","v":""},{"$f":"'[2]312 SO-Klassen'!BO18","v":""},{"$f":"'[2]312 SO-Klassen'!BP18","v":0},{"$f":"'[2]312 SO-Klassen'!BQ18","v":0},{"$f":"'[2]312 SO-Klassen'!BR18","v":0},{"$f":"'[2]312 SO-Klassen'!BS18","v":0},{"$f":"'[2]312 SO-Klassen'!BT18","v":0},{"$f":"'[2]312 SO-Klassen'!BU18","v":0},{"$f":"'[2]312 SO-Klassen'!BV18","v":0},{"$f":"'[2]312 SO-Klassen'!BW18","v":0},{"$f":"'[2]312 SO-Klassen'!BX18","v":0},{"$f":"'[2]312 SO-Klassen'!BY18","v":0},{"$f":"'[2]312 SO-Klassen'!BZ18","v":""},{"$f":"'[2]312 SO-Klassen'!CA18","v":""},{"$f":"'[2]312 SO-Klassen'!CB18","v":""},{"$f":"'[2]312 SO-Klassen'!CC18","v":""},{"$f":"'[2]312 SO-Klassen'!CD18","v":""},{"$f":"'[2]312 SO-Klassen'!CE18","v":""},{"$f":"'[2]312 SO-Klassen'!CF18","v":""},{"$f":"'[2]312 SO-Klassen'!CG18","v":""},{"$f":"'[2]312 SO-Klassen'!CH18","v":""},{"$f":"'[2]312 SO-Klassen'!CI18","v":""},{"$f":"'[2]312 SO-Klassen'!CJ18","v":""},{"$f":"'[2]312 SO-Klassen'!CK18","v":""},{"$f":"'[2]312 SO-Klassen'!CL18","v":""},{"$f":"'[2]312 SO-Klassen'!CM18","v":""},{"$f":"'[2]312 SO-Klassen'!CN18","v":""},{"$f":"'[2]312 SO-Klassen'!CO18","v":""},{"$f":"'[2]312 SO-Klassen'!CP18","v":""},{"$f":"'[2]312 SO-Klassen'!CQ18","v":""},{"$f":"'[2]312 SO-Klassen'!CR18","v":""},{"$f":"'[2]312 SO-Klassen'!CS18","v":""},{"$f":"'[2]312 SO-Klassen'!CT18","v":""},{"$f":"'[2]312 SO-Klassen'!CU18","v":""},{"$f":"'[2]312 SO-Klassen'!CV18","v":""},{"$f":"'[2]312 SO-Klassen'!CW18","v":""},{"$f":"'[2]312 SO-Klassen'!CX18","v":""},{"$f":"'[2]312 SO-Klassen'!CY18","v":""},{"$f":"'[2]312 SO-Klassen'!CZ18","v":""},{"$f":"'[2]312 SO-Klassen'!DA18","v":""},{"$f":"'[2]312 SO-Klassen'!DB18","v":""},{"$f":"'[2]312 SO-Klassen'!DC18","v":""},{"$f":"'[2]312 SO-Klassen'!DD18","v":""},{"$f":"'[2]312 SO-Klassen'!DE18","v":""},{"$f":"'[2]312 SO-Klassen'!DF18","v":""},{"$f":"'[2]312 SO-Klassen'!DG18","v":""},{"$f":"'[2]312 SO-Klassen'!DH18","v":""},{"$f":"'[2]312 SO-Klassen'!DI18","v":""},{"$f":"'[2]312 SO-Klassen'!DJ18","v":""},{"$f":"'[2]312 SO-Klassen'!DK18","v":""},{"$f":"'[2]312 SO-Klassen'!DL18","v":""},{"$f":"'[2]312 SO-Klassen'!DM18","v":""},{"$f":"'[2]312 SO-Klassen'!DN18","v":""},{"$f":"'[2]312 SO-Klassen'!DO18","v":""},{"$f":"'[2]312 SO-Klassen'!DP18","v":""},{"$f":"'[2]312 SO-Klassen'!DQ18","v":""},{"$f":"'[2]312 SO-Klassen'!DR18","v":""},{"$f":"'[2]312 SO-Klassen'!DS18","v":""},{"$f":"'[2]312 SO-Klassen'!DT18","v":""},{"$f":"'[2]312 SO-Klassen'!DU18","v":""},{"$f":"'[2]312 SO-Klassen'!DV18","v":""},{"$f":"'[2]312 SO-Klassen'!DW18","v":""},{"$f":"'[2]312 SO-Klassen'!DX18","v":""},{"$f":"'[2]312 SO-Klassen'!DY18","v":""},{"$f":"'[2]312 SO-Klassen'!DZ18","v":""},{"$f":"'[2]312 SO-Klassen'!EA18","v":""},{"$f":"'[2]312 SO-Klassen'!EB18","v":""},{"$f":"'[2]312 SO-Klassen'!EC18","v":""},{"$f":"'[2]312 SO-Klassen'!ED18","v":""},{"$f":"'[2]312 SO-Klassen'!EE18","v":""},{"$f":"'[2]312 SO-Klassen'!EF18","v":""},{"$f":"'[2]312 SO-Klassen'!EG18","v":""},{"$f":"'[2]312 SO-Klassen'!EH18","v":""},{"$f":"'[2]312 SO-Klassen'!EI18","v":""},{"$f":"'[2]312 SO-Klassen'!EJ18","v":""},{"$f":"'[2]312 SO-Klassen'!EK18","v":""},{"$f":"'[2]312 SO-Klassen'!EL18","v":""},{"$f":"'[2]312 SO-Klassen'!EM18","v":501013},{"$f":"'[2]312 SO-Klassen'!EN18","v":44475},{"$f":"'[2]312 SO-Klassen'!EO18","v":"genehmigt"},{"$f":"'[2]312 SO-Klassen'!EP18","v":"2021-10-06"},{"$f":"'[2]312 SO-Klassen'!EQ18","v":""},{"$f":"'[2]312 SO-Klassen'!ER18","v":""},{"$f":"'[2]312 SO-Klassen'!ES18","v":""},{"$f":"'[2]312 SO-Klassen'!ET18","v":""},{"$f":"'[2]312 SO-Klassen'!EU18","v":""}]
[{"$f":"'[2]312 SO-Klassen'!B19","v":"2021/22"},{"$f":"'[2]312 SO-Klassen'!C19","v":"1"},{"$f":"'[2]312 SO-Klassen'!D19","v":"3"},{"$f":"'[2]312 SO-Klassen'!E19","v":501013},{"$f":"'[2]312 SO-Klassen'!F19","v":"SO Salzburg"},{"$f":"'[2]312 SO-Klassen'!G19","v":2},{"$f":"'[2]312 SO-Klassen'!H19","v":"2000-01-01"},{"$f":"'[2]312 SO-Klassen'!I19","v":3},{"$f":"'[2]312 SO-Klassen'!J19","v":"99"},{"$f":"'[2]312 SO-Klassen'!K19","v":"X"},{"$f":"'[2]312 SO-Klassen'!L19","v":0},{"$f":"'[2]312 SO-Klassen'!M19","v":0},{"$f":"'[2]312 SO-Klassen'!N19","v":0},{"$f":"'[2]312 SO-Klassen'!O19","v":0},{"$f":"'[2]312 SO-Klassen'!P19","v":0},{"$f":"'[2]312 SO-Klassen'!Q19","v":0},{"$f":"'[2]312 SO-Klassen'!R19","v":1},{"$f":"'[2]312 SO-Klassen'!S19","v":0},{"$f":"'[2]312 SO-Klassen'!T19","v":""},{"$f":"'[2]312 SO-Klassen'!U19","v":""},{"$f":"'[2]312 SO-Klassen'!V19","v":0},{"$f":"'[2]312 SO-Klassen'!W19","v":""},{"$f":"'[2]312 SO-Klassen'!X19","v":""},{"$f":"'[2]312 SO-Klassen'!Y19","v":0},{"$f":"'[2]312 SO-Klassen'!Z19","v":""},{"$f":"'[2]312 SO-Klassen'!AA19","v":""},{"$f":"'[2]312 SO-Klassen'!AB19","v":0},{"$f":"'[2]312 SO-Klassen'!AC19","v":""},{"$f":"'[2]312 SO-Klassen'!AD19","v":""},{"$f":"'[2]312 SO-Klassen'!AE19","v":0},{"$f":"'[2]312 SO-Klassen'!AF19","v":""},{"$f":"'[2]312 SO-Klassen'!AG19","v":""},{"$f":"'[2]312 SO-Klassen'!AH19","v":0},{"$f":"'[2]312 SO-Klassen'!AI19","v":""},{"$f":"'[2]312 SO-Klassen'!AJ19","v":""},{"$f":"'[2]312 SO-Klassen'!AK19","v":0},{"$f":"'[2]312 SO-Klassen'!AL19","v":""},{"$f":"'[2]312 SO-Klassen'!AM19","v":""},{"$f":"'[2]312 SO-Klassen'!AN19","v":0},{"$f":"'[2]312 SO-Klassen'!AO19","v":""},{"$f":"'[2]312 SO-Klassen'!AP19","v":""},{"$f":"'[2]312 SO-Klassen'!AQ19","v":0},{"$f":"'[2]312 SO-Klassen'!AR19","v":""},{"$f":"'[2]312 SO-Klassen'!AS19","v":""},{"$f":"'[2]312 SO-Klassen'!AT19","v":0},{"$f":"'[2]312 SO-Klassen'!AU19","v":""},{"$f":"'[2]312 SO-Klassen'!AV19","v":""},{"$f":"'[2]312 SO-Klassen'!AW19","v":""},{"$f":"'[2]312 SO-Klassen'!AX19","v":""},{"$f":"'[2]312 SO-Klassen'!AY19","v":""},{"$f":"'[2]312 SO-Klassen'!AZ19","v":""},{"$f":"'[2]312 SO-Klassen'!BA19","v":""},{"$f":"'[2]312 SO-Klassen'!BB19","v":""},{"$f":"'[2]312 SO-Klassen'!BC19","v":""},{"$f":"'[2]312 SO-Klassen'!BD19","v":""},{"$f":"'[2]312 SO-Klassen'!BE19","v":""},{"$f":"'[2]312 SO-Klassen'!BF19","v":""},{"$f":"'[2]312 SO-Klassen'!BG19","v":""},{"$f":"'[2]312 SO-Klassen'!BH19","v":""},{"$f":"'[2]312 SO-Klassen'!BI19","v":""},{"$f":"'[2]312 SO-Klassen'!BJ19","v":""},{"$f":"'[2]312 SO-Klassen'!BK19","v":""},{"$f":"'[2]312 SO-Klassen'!BL19","v":""},{"$f":"'[2]312 SO-Klassen'!BM19","v":""},{"$f":"'[2]312 SO-Klassen'!BN19","v":""},{"$f":"'[2]312 SO-Klassen'!BO19","v":""},{"$f":"'[2]312 SO-Klassen'!BP19","v":0},{"$f":"'[2]312 SO-Klassen'!BQ19","v":0},{"$f":"'[2]312 SO-Klassen'!BR19","v":0},{"$f":"'[2]312 SO-Klassen'!BS19","v":0},{"$f":"'[2]312 SO-Klassen'!BT19","v":0},{"$f":"'[2]312 SO-Klassen'!BU19","v":0},{"$f":"'[2]312 SO-Klassen'!BV19","v":0},{"$f":"'[2]312 SO-Klassen'!BW19","v":0},{"$f":"'[2]312 SO-Klassen'!BX19","v":0},{"$f":"'[2]312 SO-Klassen'!BY19","v":0},{"$f":"'[2]312 SO-Klassen'!BZ19","v":""},{"$f":"'[2]312 SO-Klassen'!CA19","v":""},{"$f":"'[2]312 SO-Klassen'!CB19","v":""},{"$f":"'[2]312 SO-Klassen'!CC19","v":""},{"$f":"'[2]312 SO-Klassen'!CD19","v":""},{"$f":"'[2]312 SO-Klassen'!CE19","v":""},{"$f":"'[2]312 SO-Klassen'!CF19","v":""},{"$f":"'[2]312 SO-Klassen'!CG19","v":""},{"$f":"'[2]312 SO-Klassen'!CH19","v":""},{"$f":"'[2]312 SO-Klassen'!CI19","v":""},{"$f":"'[2]312 SO-Klassen'!CJ19","v":""},{"$f":"'[2]312 SO-Klassen'!CK19","v":""},{"$f":"'[2]312 SO-Klassen'!CL19","v":""},{"$f":"'[2]312 SO-Klassen'!CM19","v":""},{"$f":"'[2]312 SO-Klassen'!CN19","v":""},{"$f":"'[2]312 SO-Klassen'!CO19","v":""},{"$f":"'[2]312 SO-Klassen'!CP19","v":""},{"$f":"'[2]312 SO-Klassen'!CQ19","v":""},{"$f":"'[2]312 SO-Klassen'!CR19","v":""},{"$f":"'[2]312 SO-Klassen'!CS19","v":""},{"$f":"'[2]312 SO-Klassen'!CT19","v":""},{"$f":"'[2]312 SO-Klassen'!CU19","v":""},{"$f":"'[2]312 SO-Klassen'!CV19","v":""},{"$f":"'[2]312 SO-Klassen'!CW19","v":""},{"$f":"'[2]312 SO-Klassen'!CX19","v":""},{"$f":"'[2]312 SO-Klassen'!CY19","v":""},{"$f":"'[2]312 SO-Klassen'!CZ19","v":""},{"$f":"'[2]312 SO-Klassen'!DA19","v":""},{"$f":"'[2]312 SO-Klassen'!DB19","v":""},{"$f":"'[2]312 SO-Klassen'!DC19","v":""},{"$f":"'[2]312 SO-Klassen'!DD19","v":""},{"$f":"'[2]312 SO-Klassen'!DE19","v":""},{"$f":"'[2]312 SO-Klassen'!DF19","v":""},{"$f":"'[2]312 SO-Klassen'!DG19","v":""},{"$f":"'[2]312 SO-Klassen'!DH19","v":""},{"$f":"'[2]312 SO-Klassen'!DI19","v":""},{"$f":"'[2]312 SO-Klassen'!DJ19","v":""},{"$f":"'[2]312 SO-Klassen'!DK19","v":""},{"$f":"'[2]312 SO-Klassen'!DL19","v":""},{"$f":"'[2]312 SO-Klassen'!DM19","v":""},{"$f":"'[2]312 SO-Klassen'!DN19","v":""},{"$f":"'[2]312 SO-Klassen'!DO19","v":""},{"$f":"'[2]312 SO-Klassen'!DP19","v":""},{"$f":"'[2]312 SO-Klassen'!DQ19","v":""},{"$f":"'[2]312 SO-Klassen'!DR19","v":""},{"$f":"'[2]312 SO-Klassen'!DS19","v":""},{"$f":"'[2]312 SO-Klassen'!DT19","v":""},{"$f":"'[2]312 SO-Klassen'!DU19","v":""},{"$f":"'[2]312 SO-Klassen'!DV19","v":""},{"$f":"'[2]312 SO-Klassen'!DW19","v":""},{"$f":"'[2]312 SO-Klassen'!DX19","v":""},{"$f":"'[2]312 SO-Klassen'!DY19","v":""},{"$f":"'[2]312 SO-Klassen'!DZ19","v":""},{"$f":"'[2]312 SO-Klassen'!EA19","v":""},{"$f":"'[2]312 SO-Klassen'!EB19","v":""},{"$f":"'[2]312 SO-Klassen'!EC19","v":""},{"$f":"'[2]312 SO-Klassen'!ED19","v":""},{"$f":"'[2]312 SO-Klassen'!EE19","v":""},{"$f":"'[2]312 SO-Klassen'!EF19","v":""},{"$f":"'[2]312 SO-Klassen'!EG19","v":""},{"$f":"'[2]312 SO-Klassen'!EH19","v":""},{"$f":"'[2]312 SO-Klassen'!EI19","v":""},{"$f":"'[2]312 SO-Klassen'!EJ19","v":""},{"$f":"'[2]312 SO-Klassen'!EK19","v":""},{"$f":"'[2]312 SO-Klassen'!EL19","v":""},{"$f":"'[2]312 SO-Klassen'!EM19","v":501013},{"$f":"'[2]312 SO-Klassen'!EN19","v":44475},{"$f":"'[2]312 SO-Klassen'!EO19","v":"genehmigt"},{"$f":"'[2]312 SO-Klassen'!EP19","v":"2021-10-06"},{"$f":"'[2]312 SO-Klassen'!EQ19","v":""},{"$f":"'[2]312 SO-Klassen'!ER19","v":""},{"$f":"'[2]312 SO-Klassen'!ES19","v":""},{"$f":"'[2]312 SO-Klassen'!ET19","v":""},{"$f":"'[2]312 SO-Klassen'!EU19","v":""}]
[{"$f":"'[2]312 SO-Klassen'!B20","v":"2021/22"},{"$f":"'[2]312 SO-Klassen'!C20","v":"1"},{"$f":"'[2]312 SO-Klassen'!D20","v":"3"},{"$f":"'[2]312 SO-Klassen'!E20","v":501013},{"$f":"'[2]312 SO-Klassen'!F20","v":"SO Salzburg"},{"$f":"'[2]312 SO-Klassen'!G20","v":2},{"$f":"'[2]312 SO-Klassen'!H20","v":"2000-01-01"},{"$f":"'[2]312 SO-Klassen'!I20","v":3},{"$f":"'[2]312 SO-Klassen'!J20","v":"99"},{"$f":"'[2]312 SO-Klassen'!K20","v":"X"},{"$f":"'[2]312 SO-Klassen'!L20","v":0},{"$f":"'[2]312 SO-Klassen'!M20","v":0},{"$f":"'[2]312 SO-Klassen'!N20","v":0},{"$f":"'[2]312 SO-Klassen'!O20","v":0},{"$f":"'[2]312 SO-Klassen'!P20","v":0},{"$f":"'[2]312 SO-Klassen'!Q20","v":0},{"$f":"'[2]312 SO-Klassen'!R20","v":1},{"$f":"'[2]312 SO-Klassen'!S20","v":0},{"$f":"'[2]312 SO-Klassen'!T20","v":""},{"$f":"'[2]312 SO-Klassen'!U20","v":""},{"$f":"'[2]312 SO-Klassen'!V20","v":0},{"$f":"'[2]312 SO-Klassen'!W20","v":""},{"$f":"'[2]312 SO-Klassen'!X20","v":""},{"$f":"'[2]312 SO-Klassen'!Y20","v":0},{"$f":"'[2]312 SO-Klassen'!Z20","v":""},{"$f":"'[2]312 SO-Klassen'!AA20","v":""},{"$f":"'[2]312 SO-Klassen'!AB20","v":0},{"$f":"'[2]312 SO-Klassen'!AC20","v":""},{"$f":"'[2]312 SO-Klassen'!AD20","v":""},{"$f":"'[2]312 SO-Klassen'!AE20","v":0},{"$f":"'[2]312 SO-Klassen'!AF20","v":""},{"$f":"'[2]312 SO-Klassen'!AG20","v":""},{"$f":"'[2]312 SO-Klassen'!AH20","v":0},{"$f":"'[2]312 SO-Klassen'!AI20","v":""},{"$f":"'[2]312 SO-Klassen'!AJ20","v":""},{"$f":"'[2]312 SO-Klassen'!AK20","v":0},{"$f":"'[2]312 SO-Klassen'!AL20","v":""},{"$f":"'[2]312 SO-Klassen'!AM20","v":""},{"$f":"'[2]312 SO-Klassen'!AN20","v":0},{"$f":"'[2]312 SO-Klassen'!AO20","v":""},{"$f":"'[2]312 SO-Klassen'!AP20","v":""},{"$f":"'[2]312 SO-Klassen'!AQ20","v":0},{"$f":"'[2]312 SO-Klassen'!AR20","v":""},{"$f":"'[2]312 SO-Klassen'!AS20","v":""},{"$f":"'[2]312 SO-Klassen'!AT20","v":0},{"$f":"'[2]312 SO-Klassen'!AU20","v":""},{"$f":"'[2]312 SO-Klassen'!AV20","v":""},{"$f":"'[2]312 SO-Klassen'!AW20","v":""},{"$f":"'[2]312 SO-Klassen'!AX20","v":""},{"$f":"'[2]312 SO-Klassen'!AY20","v":""},{"$f":"'[2]312 SO-Klassen'!AZ20","v":""},{"$f":"'[2]312 SO-Klassen'!BA20","v":""},{"$f":"'[2]312 SO-Klassen'!BB20","v":""},{"$f":"'[2]312 SO-Klassen'!BC20","v":""},{"$f":"'[2]312 SO-Klassen'!BD20","v":""},{"$f":"'[2]312 SO-Klassen'!BE20","v":""},{"$f":"'[2]312 SO-Klassen'!BF20","v":""},{"$f":"'[2]312 SO-Klassen'!BG20","v":""},{"$f":"'[2]312 SO-Klassen'!BH20","v":""},{"$f":"'[2]312 SO-Klassen'!BI20","v":""},{"$f":"'[2]312 SO-Klassen'!BJ20","v":""},{"$f":"'[2]312 SO-Klassen'!BK20","v":""},{"$f":"'[2]312 SO-Klassen'!BL20","v":""},{"$f":"'[2]312 SO-Klassen'!BM20","v":""},{"$f":"'[2]312 SO-Klassen'!BN20","v":""},{"$f":"'[2]312 SO-Klassen'!BO20","v":""},{"$f":"'[2]312 SO-Klassen'!BP20","v":0},{"$f":"'[2]312 SO-Klassen'!BQ20","v":0},{"$f":"'[2]312 SO-Klassen'!BR20","v":0},{"$f":"'[2]312 SO-Klassen'!BS20","v":0},{"$f":"'[2]312 SO-Klassen'!BT20","v":0},{"$f":"'[2]312 SO-Klassen'!BU20","v":0},{"$f":"'[2]312 SO-Klassen'!BV20","v":0},{"$f":"'[2]312 SO-Klassen'!BW20","v":0},{"$f":"'[2]312 SO-Klassen'!BX20","v":0},{"$f":"'[2]312 SO-Klassen'!BY20","v":0},{"$f":"'[2]312 SO-Klassen'!BZ20","v":""},{"$f":"'[2]312 SO-Klassen'!CA20","v":""},{"$f":"'[2]312 SO-Klassen'!CB20","v":""},{"$f":"'[2]312 SO-Klassen'!CC20","v":""},{"$f":"'[2]312 SO-Klassen'!CD20","v":""},{"$f":"'[2]312 SO-Klassen'!CE20","v":""},{"$f":"'[2]312 SO-Klassen'!CF20","v":""},{"$f":"'[2]312 SO-Klassen'!CG20","v":""},{"$f":"'[2]312 SO-Klassen'!CH20","v":""},{"$f":"'[2]312 SO-Klassen'!CI20","v":""},{"$f":"'[2]312 SO-Klassen'!CJ20","v":""},{"$f":"'[2]312 SO-Klassen'!CK20","v":""},{"$f":"'[2]312 SO-Klassen'!CL20","v":""},{"$f":"'[2]312 SO-Klassen'!CM20","v":""},{"$f":"'[2]312 SO-Klassen'!CN20","v":""},{"$f":"'[2]312 SO-Klassen'!CO20","v":""},{"$f":"'[2]312 SO-Klassen'!CP20","v":""},{"$f":"'[2]312 SO-Klassen'!CQ20","v":""},{"$f":"'[2]312 SO-Klassen'!CR20","v":""},{"$f":"'[2]312 SO-Klassen'!CS20","v":""},{"$f":"'[2]312 SO-Klassen'!CT20","v":""},{"$f":"'[2]312 SO-Klassen'!CU20","v":""},{"$f":"'[2]312 SO-Klassen'!CV20","v":""},{"$f":"'[2]312 SO-Klassen'!CW20","v":""},{"$f":"'[2]312 SO-Klassen'!CX20","v":""},{"$f":"'[2]312 SO-Klassen'!CY20","v":""},{"$f":"'[2]312 SO-Klassen'!CZ20","v":""},{"$f":"'[2]312 SO-Klassen'!DA20","v":""},{"$f":"'[2]312 SO-Klassen'!DB20","v":""},{"$f":"'[2]312 SO-Klassen'!DC20","v":""},{"$f":"'[2]312 SO-Klassen'!DD20","v":""},{"$f":"'[2]312 SO-Klassen'!DE20","v":""},{"$f":"'[2]312 SO-Klassen'!DF20","v":""},{"$f":"'[2]312 SO-Klassen'!DG20","v":""},{"$f":"'[2]312 SO-Klassen'!DH20","v":""},{"$f":"'[2]312 SO-Klassen'!DI20","v":""},{"$f":"'[2]312 SO-Klassen'!DJ20","v":""},{"$f":"'[2]312 SO-Klassen'!DK20","v":""},{"$f":"'[2]312 SO-Klassen'!DL20","v":""},{"$f":"'[2]312 SO-Klassen'!DM20","v":""},{"$f":"'[2]312 SO-Klassen'!DN20","v":""},{"$f":"'[2]312 SO-Klassen'!DO20","v":""},{"$f":"'[2]312 SO-Klassen'!DP20","v":""},{"$f":"'[2]312 SO-Klassen'!DQ20","v":""},{"$f":"'[2]312 SO-Klassen'!DR20","v":""},{"$f":"'[2]312 SO-Klassen'!DS20","v":""},{"$f":"'[2]312 SO-Klassen'!DT20","v":""},{"$f":"'[2]312 SO-Klassen'!DU20","v":""},{"$f":"'[2]312 SO-Klassen'!DV20","v":""},{"$f":"'[2]312 SO-Klassen'!DW20","v":""},{"$f":"'[2]312 SO-Klassen'!DX20","v":""},{"$f":"'[2]312 SO-Klassen'!DY20","v":""},{"$f":"'[2]312 SO-Klassen'!DZ20","v":""},{"$f":"'[2]312 SO-Klassen'!EA20","v":""},{"$f":"'[2]312 SO-Klassen'!EB20","v":""},{"$f":"'[2]312 SO-Klassen'!EC20","v":""},{"$f":"'[2]312 SO-Klassen'!ED20","v":""},{"$f":"'[2]312 SO-Klassen'!EE20","v":""},{"$f":"'[2]312 SO-Klassen'!EF20","v":""},{"$f":"'[2]312 SO-Klassen'!EG20","v":""},{"$f":"'[2]312 SO-Klassen'!EH20","v":""},{"$f":"'[2]312 SO-Klassen'!EI20","v":""},{"$f":"'[2]312 SO-Klassen'!EJ20","v":""},{"$f":"'[2]312 SO-Klassen'!EK20","v":""},{"$f":"'[2]312 SO-Klassen'!EL20","v":""},{"$f":"'[2]312 SO-Klassen'!EM20","v":501013},{"$f":"'[2]312 SO-Klassen'!EN20","v":44475},{"$f":"'[2]312 SO-Klassen'!EO20","v":"genehmigt"},{"$f":"'[2]312 SO-Klassen'!EP20","v":"2021-10-06"},{"$f":"'[2]312 SO-Klassen'!EQ20","v":""},{"$f":"'[2]312 SO-Klassen'!ER20","v":""},{"$f":"'[2]312 SO-Klassen'!ES20","v":""},{"$f":"'[2]312 SO-Klassen'!ET20","v":""},{"$f":"'[2]312 SO-Klassen'!EU20","v":""}]
[{"$f":"'[2]312 SO-Klassen'!B21","v":"2021/22"},{"$f":"'[2]312 SO-Klassen'!C21","v":"1"},{"$f":"'[2]312 SO-Klassen'!D21","v":"3"},{"$f":"'[2]312 SO-Klassen'!E21","v":501013},{"$f":"'[2]312 SO-Klassen'!F21","v":"SO Salzburg"},{"$f":"'[2]312 SO-Klassen'!G21","v":2},{"$f":"'[2]312 SO-Klassen'!H21","v":"2000-01-01"},{"$f":"'[2]312 SO-Klassen'!I21","v":3},{"$f":"'[2]312 SO-Klassen'!J21","v":"99"},{"$f":"'[2]312 SO-Klassen'!K21","v":"X"},{"$f":"'[2]312 SO-Klassen'!L21","v":0},{"$f":"'[2]312 SO-Klassen'!M21","v":0},{"$f":"'[2]312 SO-Klassen'!N21","v":0},{"$f":"'[2]312 SO-Klassen'!O21","v":0},{"$f":"'[2]312 SO-Klassen'!P21","v":0},{"$f":"'[2]312 SO-Klassen'!Q21","v":0},{"$f":"'[2]312 SO-Klassen'!R21","v":1},{"$f":"'[2]312 SO-Klassen'!S21","v":0},{"$f":"'[2]312 SO-Klassen'!T21","v":""},{"$f":"'[2]312 SO-Klassen'!U21","v":""},{"$f":"'[2]312 SO-Klassen'!V21","v":0},{"$f":"'[2]312 SO-Klassen'!W21","v":""},{"$f":"'[2]312 SO-Klassen'!X21","v":""},{"$f":"'[2]312 SO-Klassen'!Y21","v":0},{"$f":"'[2]312 SO-Klassen'!Z21","v":""},{"$f":"'[2]312 SO-Klassen'!AA21","v":""},{"$f":"'[2]312 SO-Klassen'!AB21","v":0},{"$f":"'[2]312 SO-Klassen'!AC21","v":""},{"$f":"'[2]312 SO-Klassen'!AD21","v":""},{"$f":"'[2]312 SO-Klassen'!AE21","v":0},{"$f":"'[2]312 SO-Klassen'!AF21","v":""},{"$f":"'[2]312 SO-Klassen'!AG21","v":""},{"$f":"'[2]312 SO-Klassen'!AH21","v":0},{"$f":"'[2]312 SO-Klassen'!AI21","v":""},{"$f":"'[2]312 SO-Klassen'!AJ21","v":""},{"$f":"'[2]312 SO-Klassen'!AK21","v":0},{"$f":"'[2]312 SO-Klassen'!AL21","v":""},{"$f":"'[2]312 SO-Klassen'!AM21","v":""},{"$f":"'[2]312 SO-Klassen'!AN21","v":0},{"$f":"'[2]312 SO-Klassen'!AO21","v":""},{"$f":"'[2]312 SO-Klassen'!AP21","v":""},{"$f":"'[2]312 SO-Klassen'!AQ21","v":0},{"$f":"'[2]312 SO-Klassen'!AR21","v":""},{"$f":"'[2]312 SO-Klassen'!AS21","v":""},{"$f":"'[2]312 SO-Klassen'!AT21","v":0},{"$f":"'[2]312 SO-Klassen'!AU21","v":""},{"$f":"'[2]312 SO-Klassen'!AV21","v":""},{"$f":"'[2]312 SO-Klassen'!AW21","v":""},{"$f":"'[2]312 SO-Klassen'!AX21","v":""},{"$f":"'[2]312 SO-Klassen'!AY21","v":""},{"$f":"'[2]312 SO-Klassen'!AZ21","v":""},{"$f":"'[2]312 SO-Klassen'!BA21","v":""},{"$f":"'[2]312 SO-Klassen'!BB21","v":""},{"$f":"'[2]312 SO-Klassen'!BC21","v":""},{"$f":"'[2]312 SO-Klassen'!BD21","v":""},{"$f":"'[2]312 SO-Klassen'!BE21","v":""},{"$f":"'[2]312 SO-Klassen'!BF21","v":""},{"$f":"'[2]312 SO-Klassen'!BG21","v":""},{"$f":"'[2]312 SO-Klassen'!BH21","v":""},{"$f":"'[2]312 SO-Klassen'!BI21","v":""},{"$f":"'[2]312 SO-Klassen'!BJ21","v":""},{"$f":"'[2]312 SO-Klassen'!BK21","v":""},{"$f":"'[2]312 SO-Klassen'!BL21","v":""},{"$f":"'[2]312 SO-Klassen'!BM21","v":""},{"$f":"'[2]312 SO-Klassen'!BN21","v":""},{"$f":"'[2]312 SO-Klassen'!BO21","v":""},{"$f":"'[2]312 SO-Klassen'!BP21","v":0},{"$f":"'[2]312 SO-Klassen'!BQ21","v":0},{"$f":"'[2]312 SO-Klassen'!BR21","v":0},{"$f":"'[2]312 SO-Klassen'!BS21","v":0},{"$f":"'[2]312 SO-Klassen'!BT21","v":0},{"$f":"'[2]312 SO-Klassen'!BU21","v":0},{"$f":"'[2]312 SO-Klassen'!BV21","v":0},{"$f":"'[2]312 SO-Klassen'!BW21","v":0},{"$f":"'[2]312 SO-Klassen'!BX21","v":0},{"$f":"'[2]312 SO-Klassen'!BY21","v":0},{"$f":"'[2]312 SO-Klassen'!BZ21","v":""},{"$f":"'[2]312 SO-Klassen'!CA21","v":""},{"$f":"'[2]312 SO-Klassen'!CB21","v":""},{"$f":"'[2]312 SO-Klassen'!CC21","v":""},{"$f":"'[2]312 SO-Klassen'!CD21","v":""},{"$f":"'[2]312 SO-Klassen'!CE21","v":""},{"$f":"'[2]312 SO-Klassen'!CF21","v":""},{"$f":"'[2]312 SO-Klassen'!CG21","v":""},{"$f":"'[2]312 SO-Klassen'!CH21","v":""},{"$f":"'[2]312 SO-Klassen'!CI21","v":""},{"$f":"'[2]312 SO-Klassen'!CJ21","v":""},{"$f":"'[2]312 SO-Klassen'!CK21","v":""},{"$f":"'[2]312 SO-Klassen'!CL21","v":""},{"$f":"'[2]312 SO-Klassen'!CM21","v":""},{"$f":"'[2]312 SO-Klassen'!CN21","v":""},{"$f":"'[2]312 SO-Klassen'!CO21","v":""},{"$f":"'[2]312 SO-Klassen'!CP21","v":""},{"$f":"'[2]312 SO-Klassen'!CQ21","v":""},{"$f":"'[2]312 SO-Klassen'!CR21","v":""},{"$f":"'[2]312 SO-Klassen'!CS21","v":""},{"$f":"'[2]312 SO-Klassen'!CT21","v":""},{"$f":"'[2]312 SO-Klassen'!CU21","v":""},{"$f":"'[2]312 SO-Klassen'!CV21","v":""},{"$f":"'[2]312 SO-Klassen'!CW21","v":""},{"$f":"'[2]312 SO-Klassen'!CX21","v":""},{"$f":"'[2]312 SO-Klassen'!CY21","v":""},{"$f":"'[2]312 SO-Klassen'!CZ21","v":""},{"$f":"'[2]312 SO-Klassen'!DA21","v":""},{"$f":"'[2]312 SO-Klassen'!DB21","v":""},{"$f":"'[2]312 SO-Klassen'!DC21","v":""},{"$f":"'[2]312 SO-Klassen'!DD21","v":""},{"$f":"'[2]312 SO-Klassen'!DE21","v":""},{"$f":"'[2]312 SO-Klassen'!DF21","v":""},{"$f":"'[2]312 SO-Klassen'!DG21","v":""},{"$f":"'[2]312 SO-Klassen'!DH21","v":""},{"$f":"'[2]312 SO-Klassen'!DI21","v":""},{"$f":"'[2]312 SO-Klassen'!DJ21","v":""},{"$f":"'[2]312 SO-Klassen'!DK21","v":""},{"$f":"'[2]312 SO-Klassen'!DL21","v":""},{"$f":"'[2]312 SO-Klassen'!DM21","v":""},{"$f":"'[2]312 SO-Klassen'!DN21","v":""},{"$f":"'[2]312 SO-Klassen'!DO21","v":""},{"$f":"'[2]312 SO-Klassen'!DP21","v":""},{"$f":"'[2]312 SO-Klassen'!DQ21","v":""},{"$f":"'[2]312 SO-Klassen'!DR21","v":""},{"$f":"'[2]312 SO-Klassen'!DS21","v":""},{"$f":"'[2]312 SO-Klassen'!DT21","v":""},{"$f":"'[2]312 SO-Klassen'!DU21","v":""},{"$f":"'[2]312 SO-Klassen'!DV21","v":""},{"$f":"'[2]312 SO-Klassen'!DW21","v":""},{"$f":"'[2]312 SO-Klassen'!DX21","v":""},{"$f":"'[2]312 SO-Klassen'!DY21","v":""},{"$f":"'[2]312 SO-Klassen'!DZ21","v":""},{"$f":"'[2]312 SO-Klassen'!EA21","v":""},{"$f":"'[2]312 SO-Klassen'!EB21","v":""},{"$f":"'[2]312 SO-Klassen'!EC21","v":""},{"$f":"'[2]312 SO-Klassen'!ED21","v":""},{"$f":"'[2]312 SO-Klassen'!EE21","v":""},{"$f":"'[2]312 SO-Klassen'!EF21","v":""},{"$f":"'[2]312 SO-Klassen'!EG21","v":""},{"$f":"'[2]312 SO-Klassen'!EH21","v":""},{"$f":"'[2]312 SO-Klassen'!EI21","v":""},{"$f":"'[2]312 SO-Klassen'!EJ21","v":""},{"$f":"'[2]312 SO-Klassen'!EK21","v":""},{"$f":"'[2]312 SO-Klassen'!EL21","v":""},{"$f":"'[2]312 SO-Klassen'!EM21","v":501013},{"$f":"'[2]312 SO-Klassen'!EN21","v":44475},{"$f":"'[2]312 SO-Klassen'!EO21","v":"genehmigt"},{"$f":"'[2]312 SO-Klassen'!EP21","v":"2021-10-06"},{"$f":"'[2]312 SO-Klassen'!EQ21","v":""},{"$f":"'[2]312 SO-Klassen'!ER21","v":""},{"$f":"'[2]312 SO-Klassen'!ES21","v":""},{"$f":"'[2]312 SO-Klassen'!ET21","v":""},{"$f":"'[2]312 SO-Klassen'!EU21","v":""}]
[{"$f":"'[2]312 SO-Klassen'!B22","v":"2021/22"},{"$f":"'[2]312 SO-Klassen'!C22","v":"1"},{"$f":"'[2]312 SO-Klassen'!D22","v":"3"},{"$f":"'[2]312 SO-Klassen'!E22","v":501013},{"$f":"'[2]312 SO-Klassen'!F22","v":"SO Salzburg"},{"$f":"'[2]312 SO-Klassen'!G22","v":2},{"$f":"'[2]312 SO-Klassen'!H22","v":"2000-01-01"},{"$f":"'[2]312 SO-Klassen'!I22","v":3},{"$f":"'[2]312 SO-Klassen'!J22","v":"99"},{"$f":"'[2]312 SO-Klassen'!K22","v":"X"},{"$f":"'[2]312 SO-Klassen'!L22","v":0},{"$f":"'[2]312 SO-Klassen'!M22","v":0},{"$f":"'[2]312 SO-Klassen'!N22","v":0},{"$f":"'[2]312 SO-Klassen'!O22","v":0},{"$f":"'[2]312 SO-Klassen'!P22","v":0},{"$f":"'[2]312 SO-Klassen'!Q22","v":0},{"$f":"'[2]312 SO-Klassen'!R22","v":1},{"$f":"'[2]312 SO-Klassen'!S22","v":0},{"$f":"'[2]312 SO-Klassen'!T22","v":""},{"$f":"'[2]312 SO-Klassen'!U22","v":""},{"$f":"'[2]312 SO-Klassen'!V22","v":0},{"$f":"'[2]312 SO-Klassen'!W22","v":""},{"$f":"'[2]312 SO-Klassen'!X22","v":""},{"$f":"'[2]312 SO-Klassen'!Y22","v":0},{"$f":"'[2]312 SO-Klassen'!Z22","v":""},{"$f":"'[2]312 SO-Klassen'!AA22","v":""},{"$f":"'[2]312 SO-Klassen'!AB22","v":0},{"$f":"'[2]312 SO-Klassen'!AC22","v":""},{"$f":"'[2]312 SO-Klassen'!AD22","v":""},{"$f":"'[2]312 SO-Klassen'!AE22","v":0},{"$f":"'[2]312 SO-Klassen'!AF22","v":""},{"$f":"'[2]312 SO-Klassen'!AG22","v":""},{"$f":"'[2]312 SO-Klassen'!AH22","v":0},{"$f":"'[2]312 SO-Klassen'!AI22","v":""},{"$f":"'[2]312 SO-Klassen'!AJ22","v":""},{"$f":"'[2]312 SO-Klassen'!AK22","v":0},{"$f":"'[2]312 SO-Klassen'!AL22","v":""},{"$f":"'[2]312 SO-Klassen'!AM22","v":""},{"$f":"'[2]312 SO-Klassen'!AN22","v":0},{"$f":"'[2]312 SO-Klassen'!AO22","v":""},{"$f":"'[2]312 SO-Klassen'!AP22","v":""},{"$f":"'[2]312 SO-Klassen'!AQ22","v":0},{"$f":"'[2]312 SO-Klassen'!AR22","v":""},{"$f":"'[2]312 SO-Klassen'!AS22","v":""},{"$f":"'[2]312 SO-Klassen'!AT22","v":0},{"$f":"'[2]312 SO-Klassen'!AU22","v":""},{"$f":"'[2]312 SO-Klassen'!AV22","v":""},{"$f":"'[2]312 SO-Klassen'!AW22","v":""},{"$f":"'[2]312 SO-Klassen'!AX22","v":""},{"$f":"'[2]312 SO-Klassen'!AY22","v":""},{"$f":"'[2]312 SO-Klassen'!AZ22","v":""},{"$f":"'[2]312 SO-Klassen'!BA22","v":""},{"$f":"'[2]312 SO-Klassen'!BB22","v":""},{"$f":"'[2]312 SO-Klassen'!BC22","v":""},{"$f":"'[2]312 SO-Klassen'!BD22","v":""},{"$f":"'[2]312 SO-Klassen'!BE22","v":""},{"$f":"'[2]312 SO-Klassen'!BF22","v":""},{"$f":"'[2]312 SO-Klassen'!BG22","v":""},{"$f":"'[2]312 SO-Klassen'!BH22","v":""},{"$f":"'[2]312 SO-Klassen'!BI22","v":""},{"$f":"'[2]312 SO-Klassen'!BJ22","v":""},{"$f":"'[2]312 SO-Klassen'!BK22","v":""},{"$f":"'[2]312 SO-Klassen'!BL22","v":""},{"$f":"'[2]312 SO-Klassen'!BM22","v":""},{"$f":"'[2]312 SO-Klassen'!BN22","v":""},{"$f":"'[2]312 SO-Klassen'!BO22","v":""},{"$f":"'[2]312 SO-Klassen'!BP22","v":0},{"$f":"'[2]312 SO-Klassen'!BQ22","v":0},{"$f":"'[2]312 SO-Klassen'!BR22","v":0},{"$f":"'[2]312 SO-Klassen'!BS22","v":0},{"$f":"'[2]312 SO-Klassen'!BT22","v":0},{"$f":"'[2]312 SO-Klassen'!BU22","v":0},{"$f":"'[2]312 SO-Klassen'!BV22","v":0},{"$f":"'[2]312 SO-Klassen'!BW22","v":0},{"$f":"'[2]312 SO-Klassen'!BX22","v":0},{"$f":"'[2]312 SO-Klassen'!BY22","v":0},{"$f":"'[2]312 SO-Klassen'!BZ22","v":""},{"$f":"'[2]312 SO-Klassen'!CA22","v":""},{"$f":"'[2]312 SO-Klassen'!CB22","v":""},{"$f":"'[2]312 SO-Klassen'!CC22","v":""},{"$f":"'[2]312 SO-Klassen'!CD22","v":""},{"$f":"'[2]312 SO-Klassen'!CE22","v":""},{"$f":"'[2]312 SO-Klassen'!CF22","v":""},{"$f":"'[2]312 SO-Klassen'!CG22","v":""},{"$f":"'[2]312 SO-Klassen'!CH22","v":""},{"$f":"'[2]312 SO-Klassen'!CI22","v":""},{"$f":"'[2]312 SO-Klassen'!CJ22","v":""},{"$f":"'[2]312 SO-Klassen'!CK22","v":""},{"$f":"'[2]312 SO-Klassen'!CL22","v":""},{"$f":"'[2]312 SO-Klassen'!CM22","v":""},{"$f":"'[2]312 SO-Klassen'!CN22","v":""},{"$f":"'[2]312 SO-Klassen'!CO22","v":""},{"$f":"'[2]312 SO-Klassen'!CP22","v":""},{"$f":"'[2]312 SO-Klassen'!CQ22","v":""},{"$f":"'[2]312 SO-Klassen'!CR22","v":""},{"$f":"'[2]312 SO-Klassen'!CS22","v":""},{"$f":"'[2]312 SO-Klassen'!CT22","v":""},{"$f":"'[2]312 SO-Klassen'!CU22","v":""},{"$f":"'[2]312 SO-Klassen'!CV22","v":""},{"$f":"'[2]312 SO-Klassen'!CW22","v":""},{"$f":"'[2]312 SO-Klassen'!CX22","v":""},{"$f":"'[2]312 SO-Klassen'!CY22","v":""},{"$f":"'[2]312 SO-Klassen'!CZ22","v":""},{"$f":"'[2]312 SO-Klassen'!DA22","v":""},{"$f":"'[2]312 SO-Klassen'!DB22","v":""},{"$f":"'[2]312 SO-Klassen'!DC22","v":""},{"$f":"'[2]312 SO-Klassen'!DD22","v":""},{"$f":"'[2]312 SO-Klassen'!DE22","v":""},{"$f":"'[2]312 SO-Klassen'!DF22","v":""},{"$f":"'[2]312 SO-Klassen'!DG22","v":""},{"$f":"'[2]312 SO-Klassen'!DH22","v":""},{"$f":"'[2]312 SO-Klassen'!DI22","v":""},{"$f":"'[2]312 SO-Klassen'!DJ22","v":""},{"$f":"'[2]312 SO-Klassen'!DK22","v":""},{"$f":"'[2]312 SO-Klassen'!DL22","v":""},{"$f":"'[2]312 SO-Klassen'!DM22","v":""},{"$f":"'[2]312 SO-Klassen'!DN22","v":""},{"$f":"'[2]312 SO-Klassen'!DO22","v":""},{"$f":"'[2]312 SO-Klassen'!DP22","v":""},{"$f":"'[2]312 SO-Klassen'!DQ22","v":""},{"$f":"'[2]312 SO-Klassen'!DR22","v":""},{"$f":"'[2]312 SO-Klassen'!DS22","v":""},{"$f":"'[2]312 SO-Klassen'!DT22","v":""},{"$f":"'[2]312 SO-Klassen'!DU22","v":""},{"$f":"'[2]312 SO-Klassen'!DV22","v":""},{"$f":"'[2]312 SO-Klassen'!DW22","v":""},{"$f":"'[2]312 SO-Klassen'!DX22","v":""},{"$f":"'[2]312 SO-Klassen'!DY22","v":""},{"$f":"'[2]312 SO-Klassen'!DZ22","v":""},{"$f":"'[2]312 SO-Klassen'!EA22","v":""},{"$f":"'[2]312 SO-Klassen'!EB22","v":""},{"$f":"'[2]312 SO-Klassen'!EC22","v":""},{"$f":"'[2]312 SO-Klassen'!ED22","v":""},{"$f":"'[2]312 SO-Klassen'!EE22","v":""},{"$f":"'[2]312 SO-Klassen'!EF22","v":""},{"$f":"'[2]312 SO-Klassen'!EG22","v":""},{"$f":"'[2]312 SO-Klassen'!EH22","v":""},{"$f":"'[2]312 SO-Klassen'!EI22","v":""},{"$f":"'[2]312 SO-Klassen'!EJ22","v":""},{"$f":"'[2]312 SO-Klassen'!EK22","v":""},{"$f":"'[2]312 SO-Klassen'!EL22","v":""},{"$f":"'[2]312 SO-Klassen'!EM22","v":501013},{"$f":"'[2]312 SO-Klassen'!EN22","v":44475},{"$f":"'[2]312 SO-Klassen'!EO22","v":"genehmigt"},{"$f":"'[2]312 SO-Klassen'!EP22","v":"2021-10-06"},{"$f":"'[2]312 SO-Klassen'!EQ22","v":""},{"$f":"'[2]312 SO-Klassen'!ER22","v":""},{"$f":"'[2]312 SO-Klassen'!ES22","v":""},{"$f":"'[2]312 SO-Klassen'!ET22","v":""},{"$f":"'[2]312 SO-Klassen'!EU22","v":""}]
[{"$f":"'[2]312 SO-Klassen'!B23","v":"2021/22"},{"$f":"'[2]312 SO-Klassen'!C23","v":"1"},{"$f":"'[2]312 SO-Klassen'!D23","v":"3"},{"$f":"'[2]312 SO-Klassen'!E23","v":501013},{"$f":"'[2]312 SO-Klassen'!F23","v":"SO Salzburg"},{"$f":"'[2]312 SO-Klassen'!G23","v":2},{"$f":"'[2]312 SO-Klassen'!H23","v":"2000-01-01"},{"$f":"'[2]312 SO-Klassen'!I23","v":3},{"$f":"'[2]312 SO-Klassen'!J23","v":"99"},{"$f":"'[2]312 SO-Klassen'!K23","v":"X"},{"$f":"'[2]312 SO-Klassen'!L23","v":0},{"$f":"'[2]312 SO-Klassen'!M23","v":0},{"$f":"'[2]312 SO-Klassen'!N23","v":0},{"$f":"'[2]312 SO-Klassen'!O23","v":0},{"$f":"'[2]312 SO-Klassen'!P23","v":0},{"$f":"'[2]312 SO-Klassen'!Q23","v":0},{"$f":"'[2]312 SO-Klassen'!R23","v":1},{"$f":"'[2]312 SO-Klassen'!S23","v":0},{"$f":"'[2]312 SO-Klassen'!T23","v":""},{"$f":"'[2]312 SO-Klassen'!U23","v":""},{"$f":"'[2]312 SO-Klassen'!V23","v":0},{"$f":"'[2]312 SO-Klassen'!W23","v":""},{"$f":"'[2]312 SO-Klassen'!X23","v":""},{"$f":"'[2]312 SO-Klassen'!Y23","v":0},{"$f":"'[2]312 SO-Klassen'!Z23","v":""},{"$f":"'[2]312 SO-Klassen'!AA23","v":""},{"$f":"'[2]312 SO-Klassen'!AB23","v":0},{"$f":"'[2]312 SO-Klassen'!AC23","v":""},{"$f":"'[2]312 SO-Klassen'!AD23","v":""},{"$f":"'[2]312 SO-Klassen'!AE23","v":0},{"$f":"'[2]312 SO-Klassen'!AF23","v":""},{"$f":"'[2]312 SO-Klassen'!AG23","v":""},{"$f":"'[2]312 SO-Klassen'!AH23","v":0},{"$f":"'[2]312 SO-Klassen'!AI23","v":""},{"$f":"'[2]312 SO-Klassen'!AJ23","v":""},{"$f":"'[2]312 SO-Klassen'!AK23","v":0},{"$f":"'[2]312 SO-Klassen'!AL23","v":""},{"$f":"'[2]312 SO-Klassen'!AM23","v":""},{"$f":"'[2]312 SO-Klassen'!AN23","v":0},{"$f":"'[2]312 SO-Klassen'!AO23","v":""},{"$f":"'[2]312 SO-Klassen'!AP23","v":""},{"$f":"'[2]312 SO-Klassen'!AQ23","v":0},{"$f":"'[2]312 SO-Klassen'!AR23","v":""},{"$f":"'[2]312 SO-Klassen'!AS23","v":""},{"$f":"'[2]312 SO-Klassen'!AT23","v":0},{"$f":"'[2]312 SO-Klassen'!AU23","v":""},{"$f":"'[2]312 SO-Klassen'!AV23","v":""},{"$f":"'[2]312 SO-Klassen'!AW23","v":""},{"$f":"'[2]312 SO-Klassen'!AX23","v":""},{"$f":"'[2]312 SO-Klassen'!AY23","v":""},{"$f":"'[2]312 SO-Klassen'!AZ23","v":""},{"$f":"'[2]312 SO-Klassen'!BA23","v":""},{"$f":"'[2]312 SO-Klassen'!BB23","v":""},{"$f":"'[2]312 SO-Klassen'!BC23","v":""},{"$f":"'[2]312 SO-Klassen'!BD23","v":""},{"$f":"'[2]312 SO-Klassen'!BE23","v":""},{"$f":"'[2]312 SO-Klassen'!BF23","v":""},{"$f":"'[2]312 SO-Klassen'!BG23","v":""},{"$f":"'[2]312 SO-Klassen'!BH23","v":""},{"$f":"'[2]312 SO-Klassen'!BI23","v":""},{"$f":"'[2]312 SO-Klassen'!BJ23","v":""},{"$f":"'[2]312 SO-Klassen'!BK23","v":""},{"$f":"'[2]312 SO-Klassen'!BL23","v":""},{"$f":"'[2]312 SO-Klassen'!BM23","v":""},{"$f":"'[2]312 SO-Klassen'!BN23","v":""},{"$f":"'[2]312 SO-Klassen'!BO23","v":""},{"$f":"'[2]312 SO-Klassen'!BP23","v":0},{"$f":"'[2]312 SO-Klassen'!BQ23","v":0},{"$f":"'[2]312 SO-Klassen'!BR23","v":0},{"$f":"'[2]312 SO-Klassen'!BS23","v":0},{"$f":"'[2]312 SO-Klassen'!BT23","v":0},{"$f":"'[2]312 SO-Klassen'!BU23","v":0},{"$f":"'[2]312 SO-Klassen'!BV23","v":0},{"$f":"'[2]312 SO-Klassen'!BW23","v":0},{"$f":"'[2]312 SO-Klassen'!BX23","v":0},{"$f":"'[2]312 SO-Klassen'!BY23","v":0},{"$f":"'[2]312 SO-Klassen'!BZ23","v":""},{"$f":"'[2]312 SO-Klassen'!CA23","v":""},{"$f":"'[2]312 SO-Klassen'!CB23","v":""},{"$f":"'[2]312 SO-Klassen'!CC23","v":""},{"$f":"'[2]312 SO-Klassen'!CD23","v":""},{"$f":"'[2]312 SO-Klassen'!CE23","v":""},{"$f":"'[2]312 SO-Klassen'!CF23","v":""},{"$f":"'[2]312 SO-Klassen'!CG23","v":""},{"$f":"'[2]312 SO-Klassen'!CH23","v":""},{"$f":"'[2]312 SO-Klassen'!CI23","v":""},{"$f":"'[2]312 SO-Klassen'!CJ23","v":""},{"$f":"'[2]312 SO-Klassen'!CK23","v":""},{"$f":"'[2]312 SO-Klassen'!CL23","v":""},{"$f":"'[2]312 SO-Klassen'!CM23","v":""},{"$f":"'[2]312 SO-Klassen'!CN23","v":""},{"$f":"'[2]312 SO-Klassen'!CO23","v":""},{"$f":"'[2]312 SO-Klassen'!CP23","v":""},{"$f":"'[2]312 SO-Klassen'!CQ23","v":""},{"$f":"'[2]312 SO-Klassen'!CR23","v":""},{"$f":"'[2]312 SO-Klassen'!CS23","v":""},{"$f":"'[2]312 SO-Klassen'!CT23","v":""},{"$f":"'[2]312 SO-Klassen'!CU23","v":""},{"$f":"'[2]312 SO-Klassen'!CV23","v":""},{"$f":"'[2]312 SO-Klassen'!CW23","v":""},{"$f":"'[2]312 SO-Klassen'!CX23","v":""},{"$f":"'[2]312 SO-Klassen'!CY23","v":""},{"$f":"'[2]312 SO-Klassen'!CZ23","v":""},{"$f":"'[2]312 SO-Klassen'!DA23","v":""},{"$f":"'[2]312 SO-Klassen'!DB23","v":""},{"$f":"'[2]312 SO-Klassen'!DC23","v":""},{"$f":"'[2]312 SO-Klassen'!DD23","v":""},{"$f":"'[2]312 SO-Klassen'!DE23","v":""},{"$f":"'[2]312 SO-Klassen'!DF23","v":""},{"$f":"'[2]312 SO-Klassen'!DG23","v":""},{"$f":"'[2]312 SO-Klassen'!DH23","v":""},{"$f":"'[2]312 SO-Klassen'!DI23","v":""},{"$f":"'[2]312 SO-Klassen'!DJ23","v":""},{"$f":"'[2]312 SO-Klassen'!DK23","v":""},{"$f":"'[2]312 SO-Klassen'!DL23","v":""},{"$f":"'[2]312 SO-Klassen'!DM23","v":""},{"$f":"'[2]312 SO-Klassen'!DN23","v":""},{"$f":"'[2]312 SO-Klassen'!DO23","v":""},{"$f":"'[2]312 SO-Klassen'!DP23","v":""},{"$f":"'[2]312 SO-Klassen'!DQ23","v":""},{"$f":"'[2]312 SO-Klassen'!DR23","v":""},{"$f":"'[2]312 SO-Klassen'!DS23","v":""},{"$f":"'[2]312 SO-Klassen'!DT23","v":""},{"$f":"'[2]312 SO-Klassen'!DU23","v":""},{"$f":"'[2]312 SO-Klassen'!DV23","v":""},{"$f":"'[2]312 SO-Klassen'!DW23","v":""},{"$f":"'[2]312 SO-Klassen'!DX23","v":""},{"$f":"'[2]312 SO-Klassen'!DY23","v":""},{"$f":"'[2]312 SO-Klassen'!DZ23","v":""},{"$f":"'[2]312 SO-Klassen'!EA23","v":""},{"$f":"'[2]312 SO-Klassen'!EB23","v":""},{"$f":"'[2]312 SO-Klassen'!EC23","v":""},{"$f":"'[2]312 SO-Klassen'!ED23","v":""},{"$f":"'[2]312 SO-Klassen'!EE23","v":""},{"$f":"'[2]312 SO-Klassen'!EF23","v":""},{"$f":"'[2]312 SO-Klassen'!EG23","v":""},{"$f":"'[2]312 SO-Klassen'!EH23","v":""},{"$f":"'[2]312 SO-Klassen'!EI23","v":""},{"$f":"'[2]312 SO-Klassen'!EJ23","v":""},{"$f":"'[2]312 SO-Klassen'!EK23","v":""},{"$f":"'[2]312 SO-Klassen'!EL23","v":""},{"$f":"'[2]312 SO-Klassen'!EM23","v":501013},{"$f":"'[2]312 SO-Klassen'!EN23","v":44475},{"$f":"'[2]312 SO-Klassen'!EO23","v":"genehmigt"},{"$f":"'[2]312 SO-Klassen'!EP23","v":"2021-10-06"},{"$f":"'[2]312 SO-Klassen'!EQ23","v":""},{"$f":"'[2]312 SO-Klassen'!ER23","v":""},{"$f":"'[2]312 SO-Klassen'!ES23","v":""},{"$f":"'[2]312 SO-Klassen'!ET23","v":""},{"$f":"'[2]312 SO-Klassen'!EU23","v":""}]
[{"$f":"'[2]312 SO-Klassen'!B24","v":"2021/22"},{"$f":"'[2]312 SO-Klassen'!C24","v":"1"},{"$f":"'[2]312 SO-Klassen'!D24","v":"3"},{"$f":"'[2]312 SO-Klassen'!E24","v":501013},{"$f":"'[2]312 SO-Klassen'!F24","v":"SO Salzburg"},{"$f":"'[2]312 SO-Klassen'!G24","v":2},{"$f":"'[2]312 SO-Klassen'!H24","v":"2000-01-01"},{"$f":"'[2]312 SO-Klassen'!I24","v":3},{"$f":"'[2]312 SO-Klassen'!J24","v":"99"},{"$f":"'[2]312 SO-Klassen'!K24","v":"X"},{"$f":"'[2]312 SO-Klassen'!L24","v":0},{"$f":"'[2]312 SO-Klassen'!M24","v":0},{"$f":"'[2]312 SO-Klassen'!N24","v":0},{"$f":"'[2]312 SO-Klassen'!O24","v":0},{"$f":"'[2]312 SO-Klassen'!P24","v":0},{"$f":"'[2]312 SO-Klassen'!Q24","v":0},{"$f":"'[2]312 SO-Klassen'!R24","v":1},{"$f":"'[2]312 SO-Klassen'!S24","v":0},{"$f":"'[2]312 SO-Klassen'!T24","v":""},{"$f":"'[2]312 SO-Klassen'!U24","v":""},{"$f":"'[2]312 SO-Klassen'!V24","v":0},{"$f":"'[2]312 SO-Klassen'!W24","v":""},{"$f":"'[2]312 SO-Klassen'!X24","v":""},{"$f":"'[2]312 SO-Klassen'!Y24","v":0},{"$f":"'[2]312 SO-Klassen'!Z24","v":""},{"$f":"'[2]312 SO-Klassen'!AA24","v":""},{"$f":"'[2]312 SO-Klassen'!AB24","v":0},{"$f":"'[2]312 SO-Klassen'!AC24","v":""},{"$f":"'[2]312 SO-Klassen'!AD24","v":""},{"$f":"'[2]312 SO-Klassen'!AE24","v":0},{"$f":"'[2]312 SO-Klassen'!AF24","v":""},{"$f":"'[2]312 SO-Klassen'!AG24","v":""},{"$f":"'[2]312 SO-Klassen'!AH24","v":0},{"$f":"'[2]312 SO-Klassen'!AI24","v":""},{"$f":"'[2]312 SO-Klassen'!AJ24","v":""},{"$f":"'[2]312 SO-Klassen'!AK24","v":0},{"$f":"'[2]312 SO-Klassen'!AL24","v":""},{"$f":"'[2]312 SO-Klassen'!AM24","v":""},{"$f":"'[2]312 SO-Klassen'!AN24","v":0},{"$f":"'[2]312 SO-Klassen'!AO24","v":""},{"$f":"'[2]312 SO-Klassen'!AP24","v":""},{"$f":"'[2]312 SO-Klassen'!AQ24","v":0},{"$f":"'[2]312 SO-Klassen'!AR24","v":""},{"$f":"'[2]312 SO-Klassen'!AS24","v":""},{"$f":"'[2]312 SO-Klassen'!AT24","v":0},{"$f":"'[2]312 SO-Klassen'!AU24","v":""},{"$f":"'[2]312 SO-Klassen'!AV24","v":""},{"$f":"'[2]312 SO-Klassen'!AW24","v":""},{"$f":"'[2]312 SO-Klassen'!AX24","v":""},{"$f":"'[2]312 SO-Klassen'!AY24","v":""},{"$f":"'[2]312 SO-Klassen'!AZ24","v":""},{"$f":"'[2]312 SO-Klassen'!BA24","v":""},{"$f":"'[2]312 SO-Klassen'!BB24","v":""},{"$f":"'[2]312 SO-Klassen'!BC24","v":""},{"$f":"'[2]312 SO-Klassen'!BD24","v":""},{"$f":"'[2]312 SO-Klassen'!BE24","v":""},{"$f":"'[2]312 SO-Klassen'!BF24","v":""},{"$f":"'[2]312 SO-Klassen'!BG24","v":""},{"$f":"'[2]312 SO-Klassen'!BH24","v":""},{"$f":"'[2]312 SO-Klassen'!BI24","v":""},{"$f":"'[2]312 SO-Klassen'!BJ24","v":""},{"$f":"'[2]312 SO-Klassen'!BK24","v":""},{"$f":"'[2]312 SO-Klassen'!BL24","v":""},{"$f":"'[2]312 SO-Klassen'!BM24","v":""},{"$f":"'[2]312 SO-Klassen'!BN24","v":""},{"$f":"'[2]312 SO-Klassen'!BO24","v":""},{"$f":"'[2]312 SO-Klassen'!BP24","v":0},{"$f":"'[2]312 SO-Klassen'!BQ24","v":0},{"$f":"'[2]312 SO-Klassen'!BR24","v":0},{"$f":"'[2]312 SO-Klassen'!BS24","v":0},{"$f":"'[2]312 SO-Klassen'!BT24","v":0},{"$f":"'[2]312 SO-Klassen'!BU24","v":0},{"$f":"'[2]312 SO-Klassen'!BV24","v":0},{"$f":"'[2]312 SO-Klassen'!BW24","v":0},{"$f":"'[2]312 SO-Klassen'!BX24","v":0},{"$f":"'[2]312 SO-Klassen'!BY24","v":0},{"$f":"'[2]312 SO-Klassen'!BZ24","v":""},{"$f":"'[2]312 SO-Klassen'!CA24","v":""},{"$f":"'[2]312 SO-Klassen'!CB24","v":""},{"$f":"'[2]312 SO-Klassen'!CC24","v":""},{"$f":"'[2]312 SO-Klassen'!CD24","v":""},{"$f":"'[2]312 SO-Klassen'!CE24","v":""},{"$f":"'[2]312 SO-Klassen'!CF24","v":""},{"$f":"'[2]312 SO-Klassen'!CG24","v":""},{"$f":"'[2]312 SO-Klassen'!CH24","v":""},{"$f":"'[2]312 SO-Klassen'!CI24","v":""},{"$f":"'[2]312 SO-Klassen'!CJ24","v":""},{"$f":"'[2]312 SO-Klassen'!CK24","v":""},{"$f":"'[2]312 SO-Klassen'!CL24","v":""},{"$f":"'[2]312 SO-Klassen'!CM24","v":""},{"$f":"'[2]312 SO-Klassen'!CN24","v":""},{"$f":"'[2]312 SO-Klassen'!CO24","v":""},{"$f":"'[2]312 SO-Klassen'!CP24","v":""},{"$f":"'[2]312 SO-Klassen'!CQ24","v":""},{"$f":"'[2]312 SO-Klassen'!CR24","v":""},{"$f":"'[2]312 SO-Klassen'!CS24","v":""},{"$f":"'[2]312 SO-Klassen'!CT24","v":""},{"$f":"'[2]312 SO-Klassen'!CU24","v":""},{"$f":"'[2]312 SO-Klassen'!CV24","v":""},{"$f":"'[2]312 SO-Klassen'!CW24","v":""},{"$f":"'[2]312 SO-Klassen'!CX24","v":""},{"$f":"'[2]312 SO-Klassen'!CY24","v":""},{"$f":"'[2]312 SO-Klassen'!CZ24","v":""},{"$f":"'[2]312 SO-Klassen'!DA24","v":""},{"$f":"'[2]312 SO-Klassen'!DB24","v":""},{"$f":"'[2]312 SO-Klassen'!DC24","v":""},{"$f":"'[2]312 SO-Klassen'!DD24","v":""},{"$f":"'[2]312 SO-Klassen'!DE24","v":""},{"$f":"'[2]312 SO-Klassen'!DF24","v":""},{"$f":"'[2]312 SO-Klassen'!DG24","v":""},{"$f":"'[2]312 SO-Klassen'!DH24","v":""},{"$f":"'[2]312 SO-Klassen'!DI24","v":""},{"$f":"'[2]312 SO-Klassen'!DJ24","v":""},{"$f":"'[2]312 SO-Klassen'!DK24","v":""},{"$f":"'[2]312 SO-Klassen'!DL24","v":""},{"$f":"'[2]312 SO-Klassen'!DM24","v":""},{"$f":"'[2]312 SO-Klassen'!DN24","v":""},{"$f":"'[2]312 SO-Klassen'!DO24","v":""},{"$f":"'[2]312 SO-Klassen'!DP24","v":""},{"$f":"'[2]312 SO-Klassen'!DQ24","v":""},{"$f":"'[2]312 SO-Klassen'!DR24","v":""},{"$f":"'[2]312 SO-Klassen'!DS24","v":""},{"$f":"'[2]312 SO-Klassen'!DT24","v":""},{"$f":"'[2]312 SO-Klassen'!DU24","v":""},{"$f":"'[2]312 SO-Klassen'!DV24","v":""},{"$f":"'[2]312 SO-Klassen'!DW24","v":""},{"$f":"'[2]312 SO-Klassen'!DX24","v":""},{"$f":"'[2]312 SO-Klassen'!DY24","v":""},{"$f":"'[2]312 SO-Klassen'!DZ24","v":""},{"$f":"'[2]312 SO-Klassen'!EA24","v":""},{"$f":"'[2]312 SO-Klassen'!EB24","v":""},{"$f":"'[2]312 SO-Klassen'!EC24","v":""},{"$f":"'[2]312 SO-Klassen'!ED24","v":""},{"$f":"'[2]312 SO-Klassen'!EE24","v":""},{"$f":"'[2]312 SO-Klassen'!EF24","v":""},{"$f":"'[2]312 SO-Klassen'!EG24","v":""},{"$f":"'[2]312 SO-Klassen'!EH24","v":""},{"$f":"'[2]312 SO-Klassen'!EI24","v":""},{"$f":"'[2]312 SO-Klassen'!EJ24","v":""},{"$f":"'[2]312 SO-Klassen'!EK24","v":""},{"$f":"'[2]312 SO-Klassen'!EL24","v":""},{"$f":"'[2]312 SO-Klassen'!EM24","v":501013},{"$f":"'[2]312 SO-Klassen'!EN24","v":44475},{"$f":"'[2]312 SO-Klassen'!EO24","v":"genehmigt"},{"$f":"'[2]312 SO-Klassen'!EP24","v":"2021-10-06"},{"$f":"'[2]312 SO-Klassen'!EQ24","v":""},{"$f":"'[2]312 SO-Klassen'!ER24","v":""},{"$f":"'[2]312 SO-Klassen'!ES24","v":""},{"$f":"'[2]312 SO-Klassen'!ET24","v":""},{"$f":"'[2]312 SO-Klassen'!EU24","v":""}]
[{"$f":"'[2]312 SO-Klassen'!B25","v":"2021/22"},{"$f":"'[2]312 SO-Klassen'!C25","v":"1"},{"$f":"'[2]312 SO-Klassen'!D25","v":"3"},{"$f":"'[2]312 SO-Klassen'!E25","v":501013},{"$f":"'[2]312 SO-Klassen'!F25","v":"SO Salzburg"},{"$f":"'[2]312 SO-Klassen'!G25","v":2},{"$f":"'[2]312 SO-Klassen'!H25","v":"2000-01-01"},{"$f":"'[2]312 SO-Klassen'!I25","v":3},{"$f":"'[2]312 SO-Klassen'!J25","v":"99"},{"$f":"'[2]312 SO-Klassen'!K25","v":"X"},{"$f":"'[2]312 SO-Klassen'!L25","v":0},{"$f":"'[2]312 SO-Klassen'!M25","v":0},{"$f":"'[2]312 SO-Klassen'!N25","v":0},{"$f":"'[2]312 SO-Klassen'!O25","v":0},{"$f":"'[2]312 SO-Klassen'!P25","v":0},{"$f":"'[2]312 SO-Klassen'!Q25","v":0},{"$f":"'[2]312 SO-Klassen'!R25","v":1},{"$f":"'[2]312 SO-Klassen'!S25","v":0},{"$f":"'[2]312 SO-Klassen'!T25","v":""},{"$f":"'[2]312 SO-Klassen'!U25","v":""},{"$f":"'[2]312 SO-Klassen'!V25","v":0},{"$f":"'[2]312 SO-Klassen'!W25","v":""},{"$f":"'[2]312 SO-Klassen'!X25","v":""},{"$f":"'[2]312 SO-Klassen'!Y25","v":0},{"$f":"'[2]312 SO-Klassen'!Z25","v":""},{"$f":"'[2]312 SO-Klassen'!AA25","v":""},{"$f":"'[2]312 SO-Klassen'!AB25","v":0},{"$f":"'[2]312 SO-Klassen'!AC25","v":""},{"$f":"'[2]312 SO-Klassen'!AD25","v":""},{"$f":"'[2]312 SO-Klassen'!AE25","v":0},{"$f":"'[2]312 SO-Klassen'!AF25","v":""},{"$f":"'[2]312 SO-Klassen'!AG25","v":""},{"$f":"'[2]312 SO-Klassen'!AH25","v":0},{"$f":"'[2]312 SO-Klassen'!AI25","v":""},{"$f":"'[2]312 SO-Klassen'!AJ25","v":""},{"$f":"'[2]312 SO-Klassen'!AK25","v":0},{"$f":"'[2]312 SO-Klassen'!AL25","v":""},{"$f":"'[2]312 SO-Klassen'!AM25","v":""},{"$f":"'[2]312 SO-Klassen'!AN25","v":0},{"$f":"'[2]312 SO-Klassen'!AO25","v":""},{"$f":"'[2]312 SO-Klassen'!AP25","v":""},{"$f":"'[2]312 SO-Klassen'!AQ25","v":0},{"$f":"'[2]312 SO-Klassen'!AR25","v":""},{"$f":"'[2]312 SO-Klassen'!AS25","v":""},{"$f":"'[2]312 SO-Klassen'!AT25","v":0},{"$f":"'[2]312 SO-Klassen'!AU25","v":""},{"$f":"'[2]312 SO-Klassen'!AV25","v":""},{"$f":"'[2]312 SO-Klassen'!AW25","v":""},{"$f":"'[2]312 SO-Klassen'!AX25","v":""},{"$f":"'[2]312 SO-Klassen'!AY25","v":""},{"$f":"'[2]312 SO-Klassen'!AZ25","v":""},{"$f":"'[2]312 SO-Klassen'!BA25","v":""},{"$f":"'[2]312 SO-Klassen'!BB25","v":""},{"$f":"'[2]312 SO-Klassen'!BC25","v":""},{"$f":"'[2]312 SO-Klassen'!BD25","v":""},{"$f":"'[2]312 SO-Klassen'!BE25","v":""},{"$f":"'[2]312 SO-Klassen'!BF25","v":""},{"$f":"'[2]312 SO-Klassen'!BG25","v":""},{"$f":"'[2]312 SO-Klassen'!BH25","v":""},{"$f":"'[2]312 SO-Klassen'!BI25","v":""},{"$f":"'[2]312 SO-Klassen'!BJ25","v":""},{"$f":"'[2]312 SO-Klassen'!BK25","v":""},{"$f":"'[2]312 SO-Klassen'!BL25","v":""},{"$f":"'[2]312 SO-Klassen'!BM25","v":""},{"$f":"'[2]312 SO-Klassen'!BN25","v":""},{"$f":"'[2]312 SO-Klassen'!BO25","v":""},{"$f":"'[2]312 SO-Klassen'!BP25","v":0},{"$f":"'[2]312 SO-Klassen'!BQ25","v":0},{"$f":"'[2]312 SO-Klassen'!BR25","v":0},{"$f":"'[2]312 SO-Klassen'!BS25","v":0},{"$f":"'[2]312 SO-Klassen'!BT25","v":0},{"$f":"'[2]312 SO-Klassen'!BU25","v":0},{"$f":"'[2]312 SO-Klassen'!BV25","v":0},{"$f":"'[2]312 SO-Klassen'!BW25","v":0},{"$f":"'[2]312 SO-Klassen'!BX25","v":0},{"$f":"'[2]312 SO-Klassen'!BY25","v":0},{"$f":"'[2]312 SO-Klassen'!BZ25","v":""},{"$f":"'[2]312 SO-Klassen'!CA25","v":""},{"$f":"'[2]312 SO-Klassen'!CB25","v":""},{"$f":"'[2]312 SO-Klassen'!CC25","v":""},{"$f":"'[2]312 SO-Klassen'!CD25","v":""},{"$f":"'[2]312 SO-Klassen'!CE25","v":""},{"$f":"'[2]312 SO-Klassen'!CF25","v":""},{"$f":"'[2]312 SO-Klassen'!CG25","v":""},{"$f":"'[2]312 SO-Klassen'!CH25","v":""},{"$f":"'[2]312 SO-Klassen'!CI25","v":""},{"$f":"'[2]312 SO-Klassen'!CJ25","v":""},{"$f":"'[2]312 SO-Klassen'!CK25","v":""},{"$f":"'[2]312 SO-Klassen'!CL25","v":""},{"$f":"'[2]312 SO-Klassen'!CM25","v":""},{"$f":"'[2]312 SO-Klassen'!CN25","v":""},{"$f":"'[2]312 SO-Klassen'!CO25","v":""},{"$f":"'[2]312 SO-Klassen'!CP25","v":""},{"$f":"'[2]312 SO-Klassen'!CQ25","v":""},{"$f":"'[2]312 SO-Klassen'!CR25","v":""},{"$f":"'[2]312 SO-Klassen'!CS25","v":""},{"$f":"'[2]312 SO-Klassen'!CT25","v":""},{"$f":"'[2]312 SO-Klassen'!CU25","v":""},{"$f":"'[2]312 SO-Klassen'!CV25","v":""},{"$f":"'[2]312 SO-Klassen'!CW25","v":""},{"$f":"'[2]312 SO-Klassen'!CX25","v":""},{"$f":"'[2]312 SO-Klassen'!CY25","v":""},{"$f":"'[2]312 SO-Klassen'!CZ25","v":""},{"$f":"'[2]312 SO-Klassen'!DA25","v":""},{"$f":"'[2]312 SO-Klassen'!DB25","v":""},{"$f":"'[2]312 SO-Klassen'!DC25","v":""},{"$f":"'[2]312 SO-Klassen'!DD25","v":""},{"$f":"'[2]312 SO-Klassen'!DE25","v":""},{"$f":"'[2]312 SO-Klassen'!DF25","v":""},{"$f":"'[2]312 SO-Klassen'!DG25","v":""},{"$f":"'[2]312 SO-Klassen'!DH25","v":""},{"$f":"'[2]312 SO-Klassen'!DI25","v":""},{"$f":"'[2]312 SO-Klassen'!DJ25","v":""},{"$f":"'[2]312 SO-Klassen'!DK25","v":""},{"$f":"'[2]312 SO-Klassen'!DL25","v":""},{"$f":"'[2]312 SO-Klassen'!DM25","v":""},{"$f":"'[2]312 SO-Klassen'!DN25","v":""},{"$f":"'[2]312 SO-Klassen'!DO25","v":""},{"$f":"'[2]312 SO-Klassen'!DP25","v":""},{"$f":"'[2]312 SO-Klassen'!DQ25","v":""},{"$f":"'[2]312 SO-Klassen'!DR25","v":""},{"$f":"'[2]312 SO-Klassen'!DS25","v":""},{"$f":"'[2]312 SO-Klassen'!DT25","v":""},{"$f":"'[2]312 SO-Klassen'!DU25","v":""},{"$f":"'[2]312 SO-Klassen'!DV25","v":""},{"$f":"'[2]312 SO-Klassen'!DW25","v":""},{"$f":"'[2]312 SO-Klassen'!DX25","v":""},{"$f":"'[2]312 SO-Klassen'!DY25","v":""},{"$f":"'[2]312 SO-Klassen'!DZ25","v":""},{"$f":"'[2]312 SO-Klassen'!EA25","v":""},{"$f":"'[2]312 SO-Klassen'!EB25","v":""},{"$f":"'[2]312 SO-Klassen'!EC25","v":""},{"$f":"'[2]312 SO-Klassen'!ED25","v":""},{"$f":"'[2]312 SO-Klassen'!EE25","v":""},{"$f":"'[2]312 SO-Klassen'!EF25","v":""},{"$f":"'[2]312 SO-Klassen'!EG25","v":""},{"$f":"'[2]312 SO-Klassen'!EH25","v":""},{"$f":"'[2]312 SO-Klassen'!EI25","v":""},{"$f":"'[2]312 SO-Klassen'!EJ25","v":""},{"$f":"'[2]312 SO-Klassen'!EK25","v":""},{"$f":"'[2]312 SO-Klassen'!EL25","v":""},{"$f":"'[2]312 SO-Klassen'!EM25","v":501013},{"$f":"'[2]312 SO-Klassen'!EN25","v":44475},{"$f":"'[2]312 SO-Klassen'!EO25","v":"genehmigt"},{"$f":"'[2]312 SO-Klassen'!EP25","v":"2021-10-06"},{"$f":"'[2]312 SO-Klassen'!EQ25","v":""},{"$f":"'[2]312 SO-Klassen'!ER25","v":""},{"$f":"'[2]312 SO-Klassen'!ES25","v":""},{"$f":"'[2]312 SO-Klassen'!ET25","v":""},{"$f":"'[2]312 SO-Klassen'!EU25","v":""}]
[{"$f":"'[2]312 SO-Klassen'!B26","v":"2021/22"},{"$f":"'[2]312 SO-Klassen'!C26","v":"1"},{"$f":"'[2]312 SO-Klassen'!D26","v":"3"},{"$f":"'[2]312 SO-Klassen'!E26","v":501013},{"$f":"'[2]312 SO-Klassen'!F26","v":"SO Salzburg"},{"$f":"'[2]312 SO-Klassen'!G26","v":2},{"$f":"'[2]312 SO-Klassen'!H26","v":"2000-01-01"},{"$f":"'[2]312 SO-Klassen'!I26","v":3},{"$f":"'[2]312 SO-Klassen'!J26","v":"99"},{"$f":"'[2]312 SO-Klassen'!K26","v":"X"},{"$f":"'[2]312 SO-Klassen'!L26","v":0},{"$f":"'[2]312 SO-Klassen'!M26","v":0},{"$f":"'[2]312 SO-Klassen'!N26","v":0},{"$f":"'[2]312 SO-Klassen'!O26","v":0},{"$f":"'[2]312 SO-Klassen'!P26","v":0},{"$f":"'[2]312 SO-Klassen'!Q26","v":0},{"$f":"'[2]312 SO-Klassen'!R26","v":1},{"$f":"'[2]312 SO-Klassen'!S26","v":0},{"$f":"'[2]312 SO-Klassen'!T26","v":""},{"$f":"'[2]312 SO-Klassen'!U26","v":""},{"$f":"'[2]312 SO-Klassen'!V26","v":0},{"$f":"'[2]312 SO-Klassen'!W26","v":""},{"$f":"'[2]312 SO-Klassen'!X26","v":""},{"$f":"'[2]312 SO-Klassen'!Y26","v":0},{"$f":"'[2]312 SO-Klassen'!Z26","v":""},{"$f":"'[2]312 SO-Klassen'!AA26","v":""},{"$f":"'[2]312 SO-Klassen'!AB26","v":0},{"$f":"'[2]312 SO-Klassen'!AC26","v":""},{"$f":"'[2]312 SO-Klassen'!AD26","v":""},{"$f":"'[2]312 SO-Klassen'!AE26","v":0},{"$f":"'[2]312 SO-Klassen'!AF26","v":""},{"$f":"'[2]312 SO-Klassen'!AG26","v":""},{"$f":"'[2]312 SO-Klassen'!AH26","v":0},{"$f":"'[2]312 SO-Klassen'!AI26","v":""},{"$f":"'[2]312 SO-Klassen'!AJ26","v":""},{"$f":"'[2]312 SO-Klassen'!AK26","v":0},{"$f":"'[2]312 SO-Klassen'!AL26","v":""},{"$f":"'[2]312 SO-Klassen'!AM26","v":""},{"$f":"'[2]312 SO-Klassen'!AN26","v":0},{"$f":"'[2]312 SO-Klassen'!AO26","v":""},{"$f":"'[2]312 SO-Klassen'!AP26","v":""},{"$f":"'[2]312 SO-Klassen'!AQ26","v":0},{"$f":"'[2]312 SO-Klassen'!AR26","v":""},{"$f":"'[2]312 SO-Klassen'!AS26","v":""},{"$f":"'[2]312 SO-Klassen'!AT26","v":0},{"$f":"'[2]312 SO-Klassen'!AU26","v":""},{"$f":"'[2]312 SO-Klassen'!AV26","v":""},{"$f":"'[2]312 SO-Klassen'!AW26","v":""},{"$f":"'[2]312 SO-Klassen'!AX26","v":""},{"$f":"'[2]312 SO-Klassen'!AY26","v":""},{"$f":"'[2]312 SO-Klassen'!AZ26","v":""},{"$f":"'[2]312 SO-Klassen'!BA26","v":""},{"$f":"'[2]312 SO-Klassen'!BB26","v":""},{"$f":"'[2]312 SO-Klassen'!BC26","v":""},{"$f":"'[2]312 SO-Klassen'!BD26","v":""},{"$f":"'[2]312 SO-Klassen'!BE26","v":""},{"$f":"'[2]312 SO-Klassen'!BF26","v":""},{"$f":"'[2]312 SO-Klassen'!BG26","v":""},{"$f":"'[2]312 SO-Klassen'!BH26","v":""},{"$f":"'[2]312 SO-Klassen'!BI26","v":""},{"$f":"'[2]312 SO-Klassen'!BJ26","v":""},{"$f":"'[2]312 SO-Klassen'!BK26","v":""},{"$f":"'[2]312 SO-Klassen'!BL26","v":""},{"$f":"'[2]312 SO-Klassen'!BM26","v":""},{"$f":"'[2]312 SO-Klassen'!BN26","v":""},{"$f":"'[2]312 SO-Klassen'!BO26","v":""},{"$f":"'[2]312 SO-Klassen'!BP26","v":0},{"$f":"'[2]312 SO-Klassen'!BQ26","v":0},{"$f":"'[2]312 SO-Klassen'!BR26","v":0},{"$f":"'[2]312 SO-Klassen'!BS26","v":0},{"$f":"'[2]312 SO-Klassen'!BT26","v":0},{"$f":"'[2]312 SO-Klassen'!BU26","v":0},{"$f":"'[2]312 SO-Klassen'!BV26","v":0},{"$f":"'[2]312 SO-Klassen'!BW26","v":0},{"$f":"'[2]312 SO-Klassen'!BX26","v":0},{"$f":"'[2]312 SO-Klassen'!BY26","v":0},{"$f":"'[2]312 SO-Klassen'!BZ26","v":""},{"$f":"'[2]312 SO-Klassen'!CA26","v":""},{"$f":"'[2]312 SO-Klassen'!CB26","v":""},{"$f":"'[2]312 SO-Klassen'!CC26","v":""},{"$f":"'[2]312 SO-Klassen'!CD26","v":""},{"$f":"'[2]312 SO-Klassen'!CE26","v":""},{"$f":"'[2]312 SO-Klassen'!CF26","v":""},{"$f":"'[2]312 SO-Klassen'!CG26","v":""},{"$f":"'[2]312 SO-Klassen'!CH26","v":""},{"$f":"'[2]312 SO-Klassen'!CI26","v":""},{"$f":"'[2]312 SO-Klassen'!CJ26","v":""},{"$f":"'[2]312 SO-Klassen'!CK26","v":""},{"$f":"'[2]312 SO-Klassen'!CL26","v":""},{"$f":"'[2]312 SO-Klassen'!CM26","v":""},{"$f":"'[2]312 SO-Klassen'!CN26","v":""},{"$f":"'[2]312 SO-Klassen'!CO26","v":""},{"$f":"'[2]312 SO-Klassen'!CP26","v":""},{"$f":"'[2]312 SO-Klassen'!CQ26","v":""},{"$f":"'[2]312 SO-Klassen'!CR26","v":""},{"$f":"'[2]312 SO-Klassen'!CS26","v":""},{"$f":"'[2]312 SO-Klassen'!CT26","v":""},{"$f":"'[2]312 SO-Klassen'!CU26","v":""},{"$f":"'[2]312 SO-Klassen'!CV26","v":""},{"$f":"'[2]312 SO-Klassen'!CW26","v":""},{"$f":"'[2]312 SO-Klassen'!CX26","v":""},{"$f":"'[2]312 SO-Klassen'!CY26","v":""},{"$f":"'[2]312 SO-Klassen'!CZ26","v":""},{"$f":"'[2]312 SO-Klassen'!DA26","v":""},{"$f":"'[2]312 SO-Klassen'!DB26","v":""},{"$f":"'[2]312 SO-Klassen'!DC26","v":""},{"$f":"'[2]312 SO-Klassen'!DD26","v":""},{"$f":"'[2]312 SO-Klassen'!DE26","v":""},{"$f":"'[2]312 SO-Klassen'!DF26","v":""},{"$f":"'[2]312 SO-Klassen'!DG26","v":""},{"$f":"'[2]312 SO-Klassen'!DH26","v":""},{"$f":"'[2]312 SO-Klassen'!DI26","v":""},{"$f":"'[2]312 SO-Klassen'!DJ26","v":""},{"$f":"'[2]312 SO-Klassen'!DK26","v":""},{"$f":"'[2]312 SO-Klassen'!DL26","v":""},{"$f":"'[2]312 SO-Klassen'!DM26","v":""},{"$f":"'[2]312 SO-Klassen'!DN26","v":""},{"$f":"'[2]312 SO-Klassen'!DO26","v":""},{"$f":"'[2]312 SO-Klassen'!DP26","v":""},{"$f":"'[2]312 SO-Klassen'!DQ26","v":""},{"$f":"'[2]312 SO-Klassen'!DR26","v":""},{"$f":"'[2]312 SO-Klassen'!DS26","v":""},{"$f":"'[2]312 SO-Klassen'!DT26","v":""},{"$f":"'[2]312 SO-Klassen'!DU26","v":""},{"$f":"'[2]312 SO-Klassen'!DV26","v":""},{"$f":"'[2]312 SO-Klassen'!DW26","v":""},{"$f":"'[2]312 SO-Klassen'!DX26","v":""},{"$f":"'[2]312 SO-Klassen'!DY26","v":""},{"$f":"'[2]312 SO-Klassen'!DZ26","v":""},{"$f":"'[2]312 SO-Klassen'!EA26","v":""},{"$f":"'[2]312 SO-Klassen'!EB26","v":""},{"$f":"'[2]312 SO-Klassen'!EC26","v":""},{"$f":"'[2]312 SO-Klassen'!ED26","v":""},{"$f":"'[2]312 SO-Klassen'!EE26","v":""},{"$f":"'[2]312 SO-Klassen'!EF26","v":""},{"$f":"'[2]312 SO-Klassen'!EG26","v":""},{"$f":"'[2]312 SO-Klassen'!EH26","v":""},{"$f":"'[2]312 SO-Klassen'!EI26","v":""},{"$f":"'[2]312 SO-Klassen'!EJ26","v":""},{"$f":"'[2]312 SO-Klassen'!EK26","v":""},{"$f":"'[2]312 SO-Klassen'!EL26","v":""},{"$f":"'[2]312 SO-Klassen'!EM26","v":501013},{"$f":"'[2]312 SO-Klassen'!EN26","v":44475},{"$f":"'[2]312 SO-Klassen'!EO26","v":"genehmigt"},{"$f":"'[2]312 SO-Klassen'!EP26","v":"2021-10-06"},{"$f":"'[2]312 SO-Klassen'!EQ26","v":""},{"$f":"'[2]312 SO-Klassen'!ER26","v":""},{"$f":"'[2]312 SO-Klassen'!ES26","v":""},{"$f":"'[2]312 SO-Klassen'!ET26","v":""},{"$f":"'[2]312 SO-Klassen'!EU26","v":""}]

{"sheet":"STP3","index":3,"n_rows":2,"n_cols":53,"rows_kept":2,"cut":false,"hidden":false,"merged":[]}
[{"$f":"'[3]313 SO-Stunden'!B1","v":"Schuljahr"},{"$f":"'[3]313 SO-Stunden'!C1","v":"BezirkNr"},{"$f":"'[3]313 SO-Stunden'!D1","v":"Schultyp"},{"$f":"'[3]313 SO-Stunden'!E1","v":"SKZ"},{"$f":"'[3]313 SO-Stunden'!F1","v":"Schule"},{"$f":"'[3]313 SO-Stunden'!G1","v":"Status"},{"$f":"'[3]313 SO-Stunden'!H1","v":"Stichtag"},{"$f":"'[3]313 SO-Stunden'!I1","v":"Schulart"},{"$f":"'[3]313 SO-Stunden'!J1","v":"EH(x)"},{"$f":"'[3]313 SO-Stunden'!K1","v":"TXW(x)"},{"$f":"'[3]313 SO-Stunden'!L1","v":"Pflicht_Std(x)"},{"$f":"'[3]313 SO-Stunden'!M1","v":"Foe_Std(x)"},{"$f":"'[3]313 SO-Stunden'!N1","v":"Autonom_Std(x)"},{"$f":"'[3]313 SO-Stunden'!O1","v":"GTS_Grp"},{"$f":"'[3]313 SO-Stunden'!P1","v":"GLZ_Std"},{"$f":"'[3]313 SO-Stunden'!Q1","v":"ILZ_Std"},{"$f":"'[3]313 SO-Stunden'!R1","v":"SV_Std1"},{"$f":"'[3]313 SO-Stunden'!S1","v":"SV_Std2"},{"$f":"'[3]313 SO-Stunden'!T1","v":"SV_Std3"},{"$f":"'[3]313 SO-Stunden'!U1","v":"GK_Zuw(Bez)"},{"$f":"'[3]313 SO-Stunden'!V1","v":"BFD_Std(Bez)"},{"$f":"'[3]313 SO-Stunden'!W1","v":"ZusatzStd(Bez)"},{"$f":"'[3]313 SO-Stunden'!X1","v":"SINNE(Bez)"},{"$f":"'[3]313 SO-Stunden'!Y1","v":"SPH_Std(Bez)"},{"$f":"'[3]313 SO-Stunden'!Z1","v":"BER_Std(Bez)"},{"$f":"'[3]313 SO-Stunden'!AA1","v":"BFD_Anz(x)"},{"$f":"'[3]313 SO-Stunden'!AB1","v":"BFD_Std(x)"},{"$f":"'[3]313 SO-Stunden'!AC1","v":"SPH_Std(x)"},{"$f":"'[3]313 SO-Stunden'!AD1","v":"BER_Std(x)"},{"$f":"'[3]313 SO-Stunden'!AE1","v":"Rel_Grp_rk"},{"$f":"'[3]313 SO-Stunden'!AF1","v":"Rel_Std_rk"},{"$f":"'[3]313 SO-Stunden'!AG1","v":"Rel_Grp_ev"},{"$f":"'[3]313 SO-Stunden'!AH1","v":"Rel_Std_ev"},{"$f":"'[3]313 SO-Stunden'!AI1","v":"Rel_Grp_isl"},{"$f":"'[3]313 SO-Stunden'!AJ1","v":"Rel_Std_isl"},{"$f":"'[3]313 SO-Stunden'!AK1","v":"Rel_Grp_orth"},{"$f":"'[3]313 SO-Stunden'!AL1","v":"Rel_Std_orth"},{"$f":"'[3]313 SO-Stunden'!AM1","v":"Rel_Grp_sonst"},{"$f":"'[3]313 SO-Stunden'!AN1","v":"Rel_Std_sonst"},{"$f":"'[3]313 SO-Stunden'!AO1","v":"SPF_VS_Plan"},{"$f":"'[3]313 SO-Stunden'!AP1","v":"SPF_VS_Anz"},{"$f":"'[3]313 SO-Stunden'!AQ1","v":"SPF_VS_Kl"},{"$f":"'[3]313 SO-Stunden'!AR1","v":"SPF_HS_Plan"},{"$f":"'[3]313 SO-Stunden'!AS1","v":"SPF_HS_Anz"},{"$f":"'[3]313 SO-Stunden'!AT1","v":"SPF_HS_Kl"},{"$f":"'[3]313 SO-Stunden'!AU1","v":"SPF_SO_Plan"},{"$f":"'[3]313 SO-Stunden'!AV1","v":"SPF_SO_Anz"},{"$f":"'[3]313 SO-Stunden'!AW1","v":"SPF_SO_Kl"},{"$f":"'[3]313 SO-Stunden'!AX1","v":"SPF_PTS_Plan"},{"$f":"'[3]313 SO-Stunden'!AY1","v":"SPF_PTS_Anz"},{"$f":"'[3]313 SO-Stunden'!AZ1","v":"SPF_PTS_Kl"},{"$f":"'[3]313 SO-Stunden'!BA1","v":"MUU_Std(Bez)"},{"$f":"'[3]313 SO-Stunden'!BA1","v":"MUU_Std(Bez)"}]
[{"$f":"'[3]313 SO-Stunden'!B2","v":"2021/22"},{"$f":"'[3]313 SO-Stunden'!C2","v":"1"},{"$f":"'[3]313 SO-Stunden'!D2","v":"3"},{"$f":"'[3]313 SO-Stunden'!E2","v":501013},{"$f":"'[3]313 SO-Stunden'!F2","v":"SO Salzburg"},{"$f":"'[3]313 SO-Stunden'!G2","v":2},{"$f":"'[3]313 SO-Stunden'!H2","v":"2021-10-01"},{"$f":"'[3]313 SO-Stunden'!I2","v":3},{"$f":"'[3]313 SO-Stunden'!J2","v":0},{"$f":"'[3]313 SO-Stunden'!K2","v":0},{"$f":"'[3]313 SO-Stunden'!L2","v":0},{"$f":"'[3]313 SO-Stunden'!M2","v":0},{"$f":"'[3]313 SO-Stunden'!N2","v":0},{"$f":"'[3]313 SO-Stunden'!O2","v":5},{"$f":"'[3]313 SO-Stunden'!P2","v":30},{"$f":"'[3]313 SO-Stunden'!Q2","v":0},{"$f":"'[3]313 SO-Stunden'!R2","v":37},{"$f":"'[3]313 SO-Stunden'!S2","v":0},{"$f":"'[3]313 SO-Stunden'!T2","v":0},{"$f":"'[3]313 SO-Stunden'!U2","v":557},{"$f":"'[3]313 SO-Stunden'!V2","v":10},{"$f":"'[3]313 SO-Stunden'!W2","v":1},{"$f":"'[3]313 SO-Stunden'!X2","v":2},{"$f":"'[3]313 SO-Stunden'!Y2","v":5},{"$f":"'[3]313 SO-Stunden'!Z2","v":11},{"$f":"'[3]313 SO-Stunden'!AA2","v":0},{"$f":"'[3]313 SO-Stunden'!AB2","v":0},{"$f":"'[3]313 SO-Stunden'!AC2","v":0},{"$f":"'[3]313 SO-Stunden'!AD2","v":0},{"$f":"'[3]313 SO-Stunden'!AE2","v":3},{"$f":"'[3]313 SO-Stunden'!AF2","v":3},{"$f":"'[3]313 SO-Stunden'!AG2","v":0},{"$f":"'[3]313 SO-Stunden'!AH2","v":0},{"$f":"'[3]313 SO-Stunden'!AI2","v":3},{"$f":"'[3]313 SO-Stunden'!AJ2","v":3},{"$f":"'[3]313 SO-Stunden'!AK2","v":0},{"$f":"'[3]313 SO-Stunden'!AL2","v":0},{"$f":"'[3]313 SO-Stunden'!AM2","v":0},{"$f":"'[3]313 SO-Stunden'!AN2","v":0},{"$f":"'[3]313 SO-Stunden'!AO2","v":0},{"$f":"'[3]313 SO-Stunden'!AP2","v":161},{"$f":"'[3]313 SO-Stunden'!AQ2","v":73},{"$f":"'[3]313 SO-Stunden'!AR2","v":0},{"$f":"'[3]313 SO-Stunden'!AS2","v":307},{"$f":"'[3]313 SO-Stunden'!AT2","v":65},{"$f":"'[3]313 SO-Stunden'!AU2","v":0},{"$f":"'[3]313 SO-Stunden'!AV2","v":0},{"$f":"'[3]313 SO-Stunden'!AW2","v":0},{"$f":"'[3]313 SO-Stunden'!AX2","v":0},{"$f":"'[3]313 SO-Stunden'!AY2","v":23},{"$f":"'[3]313 SO-Stunden'!AZ2","v":6},{"$f":"'[3]313 SO-Stunden'!BA2","v":0},{"$f":"'[3]313 SO-Stunden'!BA2","v":"00:00:00"}]